{"text_format":"1","workbook":"xlsx","n_sheets":19,"sheets":["ALIMOVINS","ACCUEIL","PREVISION","Feuil1","ANIMAL","FOURRAGE","CONCENTRE","CMV","BILAN","MELANGE","RATION","COUT","IMPRIMER","IMPRIMCOUT","AGNEAU","PATURAGE","NOUVEAU","STOCKS","BESOINS"],"not_rendered":{"charts":11,"images":6,"macros":1,"external_links":0,"defined_names":12,"comments":2,"pivot_tables":0},"unopened":[],"bounds":{"document_bytes":16777216,"sheet_cells":100000,"rows_first":2000,"rows_last":500,"rows_between":2000,"halvings":0,"cell_chars":16384,"cell_head_chars":4096},"cells_cut":0,"cells_raw":0,"read":"whole","date_system":"1900"}

{"sheet":"ALIMOVINS","index":0,"n_rows":11,"n_cols":3,"rows_kept":11,"cut":false,"hidden":false,"merged":[[10,2,10,10],[1,1,1,10],[2,1,2,10],[3,1,3,10],[4,2,4,9],[9,1,9,10]]}
[null,"fabrice.ranoux@educagri.fr"]
[null,"     "]
[null," Rationnement des ovins "]
[null,"Fabrice RANOUX - LYCEE AGRICOLE du BOURBONNAIS - BP 1721 - 03017 MOULINS cedex - Tous droits réservés"]
[]
[]
[]
[]
[]
[null,"Version utilisable avec Microsoft® Excel 2010 et au-delà"]
[null,null,"Code de déverrouillage  →   ctrl"]

{"sheet":"ACCUEIL","index":1,"n_rows":31,"n_cols":8,"rows_kept":31,"cut":false,"hidden":false,"merged":[[18,11,18,13],[10,11,13,13],[29,2,29,9],[30,2,30,9],[1,1,1,9],[2,1,2,9],[3,1,3,9]]}
[]
[null,"ALIM'ovins(v. 5.1) "]
[null,"Rationnement des ovins"]
[null,"Fabrice RANOUX - Lycée Agricole du Bourbonnais - BP 1721 - 03017 MOULINS cedex - Tous droits réservés"]
[]
[]
[null,null,"RATION",null,"Etablissement d'une ration",null,null,"Cliquez"]
[]
[]
[null,null,"BILAN",null,"Bilan alimentaire et coût",null,null,"Cliquez"]
[]
[]
[null,null,"COUT",null,"Formulation d'aliment et coût de concentré",null,null,"Cliquez"]
[]
[]
[null,null,"PREVISION",null,"Prévision de la valeur alimentaire des aliments du commerce",null,null,"Cliquez"]
[]
[]
[null,null,"ALIMENTS",null,"Saisie de mes  nouveaux aliments",null,null,"Cliquez"]
[]
[]
[null,null,"FOURRAGES",null,"Bilan fourrager du troupeau",null,null,"Cliquez"]
[]
[]
[null,null,"AGNEAUX",null,"Besoins des agneaux à l'engrais",null,null,"Cliquez"]
[]
[]
[null,null,"PATURAGE",null,"Jours d'avance de pâturage",null,null,"Cliquez"]
[]
[null,null,"Les saisies effectuent uniquement dans les cases \"blanches\""]
[null,null,"Les cases \"bleues\" correspondent à des menus déroulants"]

{"sheet":"PREVISION","index":2,"n_rows":37,"n_cols":15,"rows_kept":37,"cut":false,"hidden":false,"merged":[[1,1,1,14],[15,12,15,14],[9,13,10,14],[4,2,4,14],[6,0,6,14],[8,12,8,14],[11,3,11,4],[13,3,13,4],[15,3,15,4],[17,3,17,4],[19,3,19,4],[8,3,9,5],[8,8,8,10],[2,1,2,14],[8,1,8,2],[9,1,9,2]]}
[]
[null,"ALIM'ovins(v. 5.1) "]
[null,"Rationnement des ovins"]
[]
[null,null,"Prévision"]
[]
["Prévision de la valeur alimentaire d'un concentré du commerce                                                            (à partir des constituants analytiques) "]
[]
[null,"Valeurs d'analyse pour 100 g  ",null,"Saisissez les constituants",null,null,null,null,"Valeurs calculées ",null,null,null,"Valeurs d'analyse"]
[null,"Calculs effectués à partir des équations INRA",null,null,null,null,null,null,"MS",{"$f":"IF(D12=\"\",\"\",100-D12)","v":""},"%",null,null,"Saisissez les constituants"]
[]
[null,"Humidité ",null,null,null,"%",null,null,"UFL",{"$f":"IF(D12=\"\",\"\",((118+(0.256*D14)+(1.58*D16)-(1.02*D18)-(2.07*I27))*(J10/10000))*(C36/1000))","v":""},null,null,"P (Phosphore)",null,"%"]
[]
[null,"Protéines Brutes (Matières Azotées Totales)","MAT ",null,null,"%",null,null,"UFV",{"$f":"IF(D12=\"\",\"\",((120+(0.214*D14)+(1.62*D16)-(1.19*D18)-(2.64*I27))*(J10/10000))*(C36/1000))","v":""},null,null,"Ca (Calcium)",null,"%"]
[]
[null,"Matière Grasse (Lipides)","MG",null,null,"%",null,null,"PDIA",{"$f":"IF(D12=\"\",\"\",C30*(J10/100))","v":""},"g / kg",null,"Minéraux absorbables"]
[]
[null,"Cellulose Brute","CB ",null,null,"%",null,null,"PDIN",{"$f":"IF(D12=\"\",\"\",C31*(J10/100))","v":""},"g / kg",null,"Pabs",{"$f":"IF(N12=\"\",\"\",N12*6.5)","v":""},"g/100 g"]
[]
[null,"Cendres Brutes (Matières Minérales)","MM",null,null,"%",null,null,"PDIE",{"$f":"IF(D12=\"\",\"\",C32*(J10/100))","v":""},"g / kg",null,"Ca abs",{"$f":"IF(N14=\"\",\"\",N14*4)","v":""},"g/100 g"]
[]
[null,null,null,null,null,null,null,null,null,{"$f":"IF(D22=\"\",\"\",D22*0.7)","v":""},{"$f":"IF(J22=\"\",\"\",\"g / kg brut\")","v":""}]
[]
[]
[]
[]
[null,"MAT",{"$f":"D14*10","v":0},null,null,null,null,null,{"$f":"IF(D14>25,6,IF(D14>20,4,2))","v":2}]
[null,"DE1",34]
[null,"MANDE1",{"$f":"C27*(1-(C28/100))","v":0}]
[null,"PDIA",{"$f":"(-0.211*C27)+(0.84*C29)","v":0}]
[null,"PDIN",{"$f":"(0.507*C27)+(0.278*C29)","v":0}]
[null,"PDIE",{"$f":"67.1-(0.22*C27)+(0.802*C29)","v":67.099999999999994}]
[null,"MG",{"$f":"D16*10","v":0}]
[null,"CB",{"$f":"D18*10","v":0}]
[null,"MM",{"$f":"D20*10","v":0}]
[null,"MO",{"$f":"1000-C35","v":1000}]
[null,"EB"]

{"sheet":"Feuil1","index":3,"n_rows":0,"n_cols":0,"rows_kept":0,"cut":false,"hidden":false,"merged":[]}

{"sheet":"ANIMAL","index":4,"n_rows":392,"n_cols":21,"rows_kept":392,"cut":false,"hidden":false,"merged":[[16,4,16,5],[14,11,15,11],[3,5,3,14],[1,1,1,14],[0,1,0,14],[5,11,6,14],[7,12,7,13],[10,11,11,11],[9,4,9,8],[7,4,8,8],[13,4,13,8],[10,4,11,8],[5,2,6,7],[12,11,13,11]]}
[null,"ALIM'ovins(v. 5.1) "]
[null,"Rationnement des ovins"]
[]
[null,null,null,null,null,"Ration"]
[]
[null,null,"1 Cliquez sur les flèches pour faire votre choix",null,null,null,null,null,null,null,null,"REPARTITION DES BESOINS",null,null,null,null,null,{"$f":"R8-R7","v":{"$error":"#VALUE!"}},{"$f":"S8-S7","v":{"$error":"#VALUE!"}},{"$f":"T8-T7","v":{"$error":"#VALUE!"}},{"$f":"U8-U7","v":{"$error":"#VALUE!"}}]
[null,null,null,null,null,null,null,null,null,null,null,null,null,null,null,null,null,{"$f":"POWER(C23,0.75)*0.033","v":0.79861501252288414},{"$f":"R7/R8","v":{"$error":"#VALUE!"}},{"$f":"POWER(C23,0.75)*2.5","v":60.501137312339708},{"$f":"T7/T8","v":{"$error":"#VALUE!"}}]
[null,"Catégorie animal",null,null,"BESOINS ALIMENTAIRES",null,null,null,null,null,null,null,"U.F.L.",null,"P.D.I.",null,null,{"$f":"F16","v":""},1,{"$f":"G16","v":""},1]
[]
[null,"Poids vif",{"$f":"IF(C8=\"\",\"\",CONCATENATE(C23,\" kg\"))","v":""},null,"CATEGORIE",null,null,null,null,null,null,"en % des besoins totaux"]
[null,null,null,null,{"$f":"CONCATENATE(C8,\"  \",C10,\"   \",C12,\"    \",C14,\"      \",C16)","v":"               "},null,null,null,null,null,null,"ENTRETIEN"]
[null,{"$f":"IF(C8=\"Brebis traite\",\"Production laitière\",IF(C8=\"brebis\",\"Stade physiologique\",\"Objectifs\"))","v":"Objectifs"}]
[null,null,null,null,null,null,null,null,null,null,null,{"$f":"CONCATENATE(ROUND(G16/F16,0),\" g PDI/UF\")","v":{"$error":"#VALUE!"}}]
[null,{"$f":"IF(C8=\"Brebis\",\"Agnelage            Etat\",\"\")","v":""},null,null,"APPORTS ALIMENTAIRES RECOMMANDES"]
[null,null,null,null,"U.E.M","U.F.L","P.D.I.","Pabs","Caabs",null,null,"PRODUCTION"]
[null,{"$f":"IF(C8=\"Brebis\",\"Période (semaines)\",\"\")","v":""},null,null,{"$f":"IF(C8=\"\",\"\",VLOOKUP($E$11,$C$39:$I$393,3))","v":""},{"$f":"IF(C8=\"\",\"\",IF(VLOOKUP($E$11,$C$39:$I$393,4)=\"ND\",\"ND\",IF(E34=2,VLOOKUP($E$11,$C$39:$I$393,4),VLOOKUP($E$11,$C$39:$I$393,4)+0.2)))","v":""},{"$f":"IF(C8=\"\",\"\",VLOOKUP($E$11,$C$39:$I$393,5))","v":""},{"$f":"IF(C8=\"\",\"\",VLOOKUP($E$11,$C$39:$I$393,6))","v":""},{"$f":"IF(C8=\"\",\"\",VLOOKUP($E$11,$C$39:$I$393,7))","v":""}]
[null,null,"ND: non disponible",null,{"$f":"CONCATENATE(ROUND(F16/E16,2),\" UFL / UEM\")","v":{"$error":"#VALUE!"}},null,{"$f":"CONCATENATE(ROUND(G16/F16,0),\" g PDI / UFL\")","v":{"$error":"#VALUE!"}},null,{"$f":"CONCATENATE(\"Ca/P = \",ROUND(I16/H16,1))","v":{"$error":"#VALUE!"}}]
[]
[]
[]
[]
[]
[null,null,70,null,null,null,null,null,"30 kg"]
[null,null,"Brebis",{"$f":"IF(C8=\"Brebis traite\",\"0,5 l/jour\",IF(C8=\"Brebis\",\"Allaitante\",\"Croissance\"))","v":"Croissance"},{"$f":"IF(C12=\"Engrais\",\"Mauvais état (1 - 1.5)\",IF(C8=\"Bélier\",\"\",IF(C8=\"Agnelle\",\"\",IF(C8=\"Brebis traite\",\"\",IF(C12=\"Vide\",\"Sans prise de poids - Entretien\",IF(C12=\"gestante\",D31,F31))))))","v":"Semaines 0 à + 3 "},{"$f":"IF(C12=\"Engrais\",\"GMQ  50 g/j\",IF(C8=\"Bélier\",\"\",IF(C8=\"Agnelle\",\"\",IF(C8=\"Brebis traite\",\"\",IF(C12=\"Vide\",\"Mauvais Etat (< 2,5)\",\"Simple\")))))","v":"Simple"},null,null,"40 kg"]
[null,null,"Bélier",{"$f":"IF(C8=\"Brebis traite\",\"1,0 l/jour\",IF(C8=\"Brebis\",\"Gestante\",\"Flushing\"))","v":"Flushing"},{"$f":"IF(C12=\"Engrais\",\"Etat moyen (2 - 2.5)\",IF(C8=\"Bélier\",\"\",IF(C8=\"Agnelle\",\"\",IF(C8=\"Brebis traite\",\"\",IF(C12=\"Vide\",\"Avec prise de poids + 150 g/j\",IF(C12=\"gestante\",D32,F32))))))","v":"Semaines + 4 à + 6"},{"$f":"IF(C12=\"Engrais\",\"GMQ 100 g/j\",IF(C8=\"Bélier\",\"\",IF(C8=\"Agnelle\",\"\",IF(C8=\"Brebis traite\",\"\",IF(C12=\"Vide\",\"Etat Moyen (2,5 - 3,5)\",\"Double\")))))","v":"Double"},null,null,"50 kg","30 kg ","70 kg"]
[null,null,"Agnelle",{"$f":"IF(C8=\"Brebis traite\",\"2,0 l/jour\",IF(C8=\"Brebis\",\"Vide\",\"Entretien\"))","v":"Entretien"},{"$f":"IF(C12=\"Engrais\",\"Bon état (3 - 3.5)\",IF(C8=\"Bélier\",\"\",IF(C8=\"Agnelle\",\"\",IF(C8=\"Brebis traite\",\"\",IF(C12=\"Vide\",\"flushing + 100 g/j\",IF(C12=\"gestante\",D33,F33))))))","v":"Semaines + 7 à + 10"},{"$f":"IF(C12=\"Engrais\",\"GMQ 150 g/j\",IF(C8=\"Bélier\",\"\",IF(C8=\"Agnelle\",\"\",IF(C8=\"Brebis traite\",\"\",IF(C12=\"Vide\",\"Bon Etat (> 3,5)\",IF(C12=\"Allaitante\",\"Triple\",\"Inconnu\"))))))","v":"Inconnu"},null,null,"60 kg","40 kg ","80 kg "]
[null,null,"Brebis traite",{"$f":"IF(C8=\"Brebis traite\",\"2,5 l/jour\",IF(C8=\"Brebis\",\"Engrais\",\"\"))","v":""},null,null,null,null,"70 kg","50 kg","90 kg"]
[null,null,null,{"$f":"IF(C8=\"Brebis traite\",\"3,0 l/jour\",\"\")","v":""},null,null,null,null,"80 kg"," ","100 kg"]
[null,null,"60 kg",{"$f":"IF(C8=\"Brebis traite\",\"3,5 l/jour\",\"\")","v":""},null,null,null,null,"90 kg"," "," "]
[null,null,{"$f":"IF($C$9=\"brebis\",I25,IF($C$9=\"Agnelle\",J25,K25))","v":"70 kg"},null,null,null,null,null,"100 kg"," "," "]
[null,null,"80 kg ","Semaines - 5 à - 6",null,"Semaines 0 à + 3 ",null,null,null," "]
[null,null,"90 kg","Semaines - 3 à - 4",null,"Semaines + 4 à + 6"]
[null,null,"100 kg","Semaines - 2 à 0",null,"Semaines + 7 à + 10",null,null,"Bergerie"]
[null,null,null,null,2,null,null,null,"Plein air"]
[]
[]
[]
[null,null,"Catégorie",null,"UEM","UFL","PDI","Pabs","Caabs"]
[null,null,"Agnelle  100 kg   Croissance          ",null,"ND","ND","ND","ND","ND"]
[null,null,"Agnelle  100 kg   Entretien          ",null,"ND","ND","ND","ND","ND"]
[null,null,"Agnelle  100 kg   Flushing          ",null,"ND","ND","ND","ND","ND"]
[null,null,"Agnelle  30 kg   Croissance          ",13,1,0.56999999999999995,52,0.9,1]
[null,null,"Agnelle  30 kg   Entretien          ",15,1,0.44,32,0.6,0.8]
[null,null,"Agnelle  30 kg   Flushing          ",14,1,1,54,0.6,0.8]
[null,null,"Agnelle  40 kg   Croissance          ",16,1.2,0.78,62,1.4,1.5]
[null,null,"Agnelle  40 kg   Entretien          ",18,1.2,0.52,40,0.8,1]
[null,null,"Agnelle  40 kg   Flushing          ",17,1.2,1.08,62,0.8,1]
[null,null,"Agnelle  50 kg   Croissance          ",19,1.3,0.84,69,1.6,1.7]
[null,null,"Agnelle  50 kg   Entretien          ",21,1.3,0.62,47,1,1.2]
[null,null,"Agnelle  50 kg   Flushing          ",20,1.3,0.84,69,1,1.2]
[null,null,"Agnelle  60 kg   Croissance          ",null,"ND","ND","ND","ND","ND"]
[null,null,"Agnelle  60 kg   Entretien          ",null,"ND","ND","ND","ND","ND"]
[null,null,"Agnelle  60 kg   Flushing          ",null,"ND","ND","ND","ND","ND"]
[null,null,"Agnelle  70 kg   Croissance          ",null,"ND","ND","ND","ND","ND"]
[null,null,"Agnelle  70 kg   Entretien          ",null,"ND","ND","ND","ND","ND"]
[null,null,"Agnelle  70 kg   Flushing          ",null,"ND","ND","ND","ND","ND"]
[null,null,"Agnelle  80 kg   Croissance          ",null,"ND","ND","ND","ND","ND"]
[null,null,"Agnelle  80 kg   Entretien          ",null,"ND","ND","ND","ND","ND"]
[null,null,"Agnelle  80 kg   Flushing          ",null,"ND","ND","ND","ND","ND"]
[null,null,"Agnelle  90 kg   Croissance          ",null,"ND","ND","ND","ND","ND"]
[null,null,"Agnelle  90 kg   Entretien          ",null,"ND","ND","ND","ND","ND"]
[null,null,"Agnelle  90 kg   Flushing          ",null,"ND","ND","ND","ND","ND"]
[null,null,"Bélier  100 kg   Croissance          ",10,"ND","ND","ND","ND","ND"]
[null,null,"Bélier  100 kg   Entretien          ",12,2.8,1.1000000000000001,88,2.2000000000000002,2.9]
[null,null,"Bélier  100 kg   Flushing          ",11,2.8,1.66,110,2.2000000000000002,2.9]
[null,null,"Bélier  30 kg   Croissance          ",null,"ND","ND","ND","ND","ND"]
[null,null,"Bélier  30 kg   Entretien          ",null,"ND","ND","ND","ND","ND"]
[null,null,"Bélier  30 kg   Flushing          ",null,"ND","ND","ND","ND","ND"]
[null,null,"Bélier  40 kg   Croissance          ",null,"ND","ND","ND","ND","ND"]
[null,null,"Bélier  40 kg   Entretien          ",null,"ND","ND","ND","ND","ND"]
[null,null,"Bélier  40 kg   Flushing          ",null,"ND","ND","ND","ND","ND"]
[null,null,"Bélier  50 kg   Croissance          ",null,1.8,1.1100000000000001,86,1.9,2.4]
[null,null,"Bélier  50 kg   Entretien          ",null,1.8,0.72,63,1.2,1.4]
[null,null,"Bélier  50 kg   Flushing          ",null,1.8,1.29,75,1.2,2.7]
[null,null,"Bélier  60 kg   Croissance          ",null,2,1.19,93,2.1,2.7]
[null,null,"Bélier  60 kg   Entretien          ",null,2,0.8,60,1.4,1.7]
[null,null,"Bélier  60 kg   Flushing          ",null,2,1.36,82,1.4,3]
[null,null,"Bélier  70 kg   Croissance          ",1,2.2000000000000002,1.27,100,2.2999999999999998,3]
[null,null,"Bélier  70 kg   Entretien          ",3,2.2000000000000002,0.88000000000000012,67,1.6,2]
[null,null,"Bélier  70 kg   Flushing          ",2,2.2000000000000002,1.44,89,1.6,2]
[null,null,"Bélier  80 kg   Croissance          ",4,2.4,1.35,107,2.5,3.3]
[null,null,"Bélier  80 kg   Entretien          ",6,2.4,0.96,74,1.8,2.2999999999999998]
[null,null,"Bélier  80 kg   Flushing          ",5,2.4,1.52,96,1.8,2.2999999999999998]
[null,null,"Bélier  90 kg   Croissance          ",7,"ND","ND","ND","ND","ND"]
[null,null,"Bélier  90 kg   Entretien          ",9,2.6,1.04,81,2,2.6]
[null,null,"Bélier  90 kg   Flushing          ",8,2.6,1.6,103,2,2.6]
[null,null,"Brebis  100 kg   Allaitante    Double      Semaines + 4 à + 6",116,"ND","ND","ND","ND","ND"]
[null,null,"Brebis  100 kg   Allaitante    Double      Semaines + 7 à + 10",117,"ND","ND","ND","ND","ND"]
[null,null,"Brebis  100 kg   Allaitante    Double      Semaines 0 à + 3 ",115,"ND","ND","ND","ND","ND"]
[null,null,"Brebis  100 kg   Allaitante    Simple      Semaines + 4 à + 6",113,"ND","ND","ND","ND","ND"]
[null,null,"Brebis  100 kg   Allaitante    Simple      Semaines + 7 à + 10",114,"ND","ND","ND","ND","ND"]
[null,null,"Brebis  100 kg   Allaitante    Simple      Semaines 0 à + 3 ",112,"ND","ND","ND","ND","ND"]
[null,null,"Brebis  100 kg   Gestante    Double      Semaines - 2 à 0",90,"ND","ND","ND","ND","ND"]
[null,null,"Brebis  100 kg   Gestante    Double      Semaines - 3 à - 4",89,"ND","ND","ND","ND","ND"]
[null,null,"Brebis  100 kg   Gestante    Double      Semaines - 5 à - 6",88,"ND","ND","ND","ND","ND"]
[null,null,"Brebis  100 kg   Gestante    Inconnu      Semaines - 2 à 0",93,"ND","ND","ND","ND","ND"]
[null,null,"Brebis  100 kg   Gestante    Inconnu      Semaines - 3 à - 4",92,"ND","ND","ND","ND","ND"]
[null,null,"Brebis  100 kg   Gestante    Inconnu      Semaines - 5 à - 6",91,"ND","ND","ND","ND","ND"]
[null,null,"Brebis  100 kg   Gestante    Simple      Semaines - 2 à 0",87,"ND","ND","ND","ND","ND"]
[null,null,"Brebis  100 kg   Gestante    Simple      Semaines - 3 à - 4",86,"ND","ND","ND","ND","ND"]
[null,null,"Brebis  100 kg   Gestante    Simple      Semaines - 5 à - 6",85,"ND","ND","ND","ND","ND"]
[null,null,"Brebis  100 kg   Vide    Bon Etat (> 3,5)      Avec prise de poids + 150 g/j",56,"ND","ND","ND","ND","ND"]
[null,null,"Brebis  100 kg   Vide    Bon Etat (> 3,5)      flushing + 100 g/j",57,"ND","ND","ND","ND","ND"]
[null,null,"Brebis  100 kg   Vide    Bon Etat (> 3,5)      Sans prise de poids - Entretien",55,"ND","ND","ND","ND","ND"]
[null,null,"Brebis  100 kg   Vide    Etat Moyen (2,5 - 3,5)      Avec prise de poids + 150 g/j",53,"ND","ND","ND","ND","ND"]
[null,null,"Brebis  100 kg   Vide    Etat Moyen (2,5 - 3,5)      flushing + 100 g/j",54,"ND","ND","ND","ND","ND"]
[null,null,"Brebis  100 kg   Vide    Etat Moyen (2,5 - 3,5)      Sans prise de poids - Entretien",52,"ND","ND","ND","ND","ND"]
[null,null,"Brebis  100 kg   Vide    Mauvais Etat (< 2,5)      Avec prise de poids + 150 g/j",50,"ND","ND","ND","ND","ND"]
[null,null,"Brebis  100 kg   Vide    Mauvais Etat (< 2,5)      flushing + 100 g/j",51,"ND","ND","ND","ND","ND"]
[null,null,"Brebis  100 kg   Vide    Mauvais Etat (< 2,5)      Sans prise de poids - Entretien",49,"ND","ND","ND","ND","ND"]
[null,null,"Brebis  30 kg   Allaitante    Double      Semaines + 4 à + 6",116,"ND","ND","ND","ND","ND"]
[null,null,"Brebis  30 kg   Allaitante    Double      Semaines + 7 à + 10",117,"ND","ND","ND","ND","ND"]
[null,null,"Brebis  30 kg   Allaitante    Double      Semaines 0 à + 3 ",115,"ND","ND","ND","ND","ND"]
[null,null,"Brebis  30 kg   Allaitante    Simple      Semaines + 4 à + 6",113,"ND","ND","ND","ND","ND"]
[null,null,"Brebis  30 kg   Allaitante    Simple      Semaines + 7 à + 10",114,"ND","ND","ND","ND","ND"]
[null,null,"Brebis  30 kg   Allaitante    Simple      Semaines 0 à + 3 ",112,"ND","ND","ND","ND","ND"]
[null,null,"Brebis  30 kg   Allaitante    Triple      Semaines + 4 à + 6",null,"ND","ND","ND","ND","ND"]
[null,null,"Brebis  30 kg   Allaitante    Triple      Semaines + 7 à + 10",null,"ND","ND","ND","ND","ND"]
[null,null,"Brebis  30 kg   Allaitante    Triple      Semaines 0 à + 3 ",null,"ND","ND","ND","ND","ND"]
[null,null,"Brebis  30 kg   Gestante    Double      Semaines - 2 à 0",90,"ND","ND","ND","ND","ND"]
[null,null,"Brebis  30 kg   Gestante    Double      Semaines - 3 à - 4",89,"ND","ND","ND","ND","ND"]
[null,null,"Brebis  30 kg   Gestante    Double      Semaines - 5 à - 6",88,"ND","ND","ND","ND","ND"]
[null,null,"Brebis  30 kg   Gestante    Inconnu      Semaines - 2 à 0",93,"ND","ND","ND","ND","ND"]
[null,null,"Brebis  30 kg   Gestante    Inconnu      Semaines - 3 à - 4",92,"ND","ND","ND","ND","ND"]
[null,null,"Brebis  30 kg   Gestante    Inconnu      Semaines - 5 à - 6",91,"ND","ND","ND","ND","ND"]
[null,null,"Brebis  30 kg   Gestante    Simple      Semaines - 2 à 0",87,"ND","ND","ND","ND","ND"]
[null,null,"Brebis  30 kg   Gestante    Simple      Semaines - 3 à - 4",86,"ND","ND","ND","ND","ND"]
[null,null,"Brebis  30 kg   Gestante    Simple      Semaines - 5 à - 6",85,"ND","ND","ND","ND","ND"]
[null,null,"Brebis  30 kg   Vide    Bon Etat (> 3,5)      Avec prise de poids + 150 g/j",56,"ND","ND","ND","ND","ND"]
[null,null,"Brebis  30 kg   Vide    Bon Etat (> 3,5)      flushing + 100 g/j",57,"ND","ND","ND","ND","ND"]
[null,null,"Brebis  30 kg   Vide    Bon Etat (> 3,5)      Sans prise de poids - Entretien",55,"ND","ND","ND","ND","ND"]
[null,null,"Brebis  30 kg   Vide    Etat Moyen (2,5 - 3,5)      Avec prise de poids + 150 g/j",53,"ND","ND","ND","ND","ND"]
[null,null,"Brebis  30 kg   Vide    Etat Moyen (2,5 - 3,5)      flushing + 100 g/j",54,"ND","ND","ND","ND","ND"]
[null,null,"Brebis  30 kg   Vide    Etat Moyen (2,5 - 3,5)      Sans prise de poids - Entretien",52,"ND","ND","ND","ND","ND"]
[null,null,"Brebis  30 kg   Vide    Mauvais Etat (< 2,5)      Avec prise de poids + 150 g/j",50,"ND","ND","ND","ND","ND"]
[null,null,"Brebis  30 kg   Vide    Mauvais Etat (< 2,5)      flushing + 100 g/j",51,"ND","ND","ND","ND","ND"]
[null,null,"Brebis  30 kg   Vide    Mauvais Etat (< 2,5)      Sans prise de poids - Entretien",49,"ND","ND","ND","ND","ND"]
[null,null,"Brebis  40 kg   Allaitante    Double      Semaines + 4 à + 6",116,"ND","ND","ND","ND","ND"]
[null,null,"Brebis  40 kg   Allaitante    Double      Semaines + 7 à + 10",117,"ND","ND","ND","ND","ND"]
[null,null,"Brebis  40 kg   Allaitante    Double      Semaines 0 à + 3 ",115,"ND","ND","ND","ND","ND"]
[null,null,"Brebis  40 kg   Allaitante    Simple      Semaines + 4 à + 6",113,"ND","ND","ND","ND","ND"]
[null,null,"Brebis  40 kg   Allaitante    Simple      Semaines + 7 à + 10",114,"ND","ND","ND","ND","ND"]
[null,null,"Brebis  40 kg   Allaitante    Simple      Semaines 0 à + 3 ",112,"ND","ND","ND","ND","ND"]
[null,null,"Brebis  40 kg   Allaitante    Triple      Semaines + 4 à + 6",null,"ND","ND","ND","ND","ND"]
[null,null,"Brebis  40 kg   Allaitante    Triple      Semaines + 7 à + 10",null,"ND","ND","ND","ND","ND"]
[null,null,"Brebis  40 kg   Allaitante    Triple      Semaines 0 à + 3 ",null,"ND","ND","ND","ND","ND"]
[null,null,"Brebis  40 kg   Engrais    GMQ  50 g/j      Bon état (3 - 3.5)",null,1.28833858060262,{"$f":"F183-0.08","v":0.80000000000000016},{"$f":"G183-7","v":48},1,0.8]
[null,null,"Brebis  40 kg   Engrais    GMQ  50 g/j      Etat moyen (2 - 2.5)",null,1.41558189720535,0.75000000000000011,44,1,0.8]
[null,null,"Brebis  40 kg   Engrais    GMQ  50 g/j      Mauvais état (1 - 1.5)",null,1.54282521380808,0.71000000000000008,41,1,0.8]
[null,null,"Brebis  40 kg   Engrais    GMQ 100 g/j      Bon état (3 - 3.5)",null,1.28833858060262,1.0799999999999998,59,1,0.8]
[null,null,"Brebis  40 kg   Engrais    GMQ 100 g/j      Etat moyen (2 - 2.5)",null,1.41558189720535,1.0299999999999998,55,1,0.8]
[null,null,"Brebis  40 kg   Engrais    GMQ 100 g/j      Mauvais état (1 - 1.5)",null,1.54282521380808,0.98999999999999988,52,1,0.8]
[null,null,"Brebis  40 kg   Engrais    GMQ 150 g/j      Bon état (3 - 3.5)",null,1.28833858060262,1.3599999999999999,70,1,0.8]
[null,null,"Brebis  40 kg   Engrais    GMQ 150 g/j      Etat moyen (2 - 2.5)",null,1.41558189720535,1.3099999999999998,66,1,0.8]
[null,null,"Brebis  40 kg   Engrais    GMQ 150 g/j      Mauvais état (1 - 1.5)",null,1.54282521380808,1.2699999999999998,63,1,0.8]
[null,null,"Brebis  40 kg   Gestante    Double      Semaines - 2 à 0",90,"ND","ND","ND","ND","ND"]
[null,null,"Brebis  40 kg   Gestante    Double      Semaines - 3 à - 4",89,"ND","ND","ND","ND","ND"]
[null,null,"Brebis  40 kg   Gestante    Double      Semaines - 5 à - 6",88,"ND","ND","ND","ND","ND"]
[null,null,"Brebis  40 kg   Gestante    Inconnu      Semaines - 2 à 0",93,"ND","ND","ND","ND","ND"]
[null,null,"Brebis  40 kg   Gestante    Inconnu      Semaines - 3 à - 4",92,"ND","ND","ND","ND","ND"]
[null,null,"Brebis  40 kg   Gestante    Inconnu      Semaines - 5 à - 6",91,"ND","ND","ND","ND","ND"]
[null,null,"Brebis  40 kg   Gestante    Simple      Semaines - 2 à 0",87,"ND","ND","ND","ND","ND"]
[null,null,"Brebis  40 kg   Gestante    Simple      Semaines - 3 à - 4",86,"ND","ND","ND","ND","ND"]
[null,null,"Brebis  40 kg   Gestante    Simple      Semaines - 5 à - 6",85,"ND","ND","ND","ND","ND"]
[null,null,"Brebis  40 kg   Vide    Bon Etat (> 3,5)      Avec prise de poids + 150 g/j",56,"ND","ND","ND","ND","ND"]
[null,null,"Brebis  40 kg   Vide    Bon Etat (> 3,5)      flushing + 100 g/j",57,"ND","ND","ND","ND","ND"]
[null,null,"Brebis  40 kg   Vide    Bon Etat (> 3,5)      Sans prise de poids - Entretien",55,"ND","ND","ND","ND","ND"]
[null,null,"Brebis  40 kg   Vide    Etat Moyen (2,5 - 3,5)      Avec prise de poids + 150 g/j",53,"ND","ND","ND","ND","ND"]
[null,null,"Brebis  40 kg   Vide    Etat Moyen (2,5 - 3,5)      flushing + 100 g/j",54,"ND","ND","ND","ND","ND"]
[null,null,"Brebis  40 kg   Vide    Etat Moyen (2,5 - 3,5)      Sans prise de poids - Entretien",52,"ND","ND","ND","ND","ND"]
[null,null,"Brebis  40 kg   Vide    Mauvais Etat (< 2,5)      Avec prise de poids + 150 g/j",50,"ND","ND","ND","ND","ND"]
[null,null,"Brebis  40 kg   Vide    Mauvais Etat (< 2,5)      flushing + 100 g/j",51,"ND","ND","ND","ND","ND"]
[null,null,"Brebis  40 kg   Vide    Mauvais Etat (< 2,5)      Sans prise de poids - Entretien",49,"ND","ND","ND","ND","ND"]
[null,null,"Brebis  50 kg   Allaitante    Double      Semaines + 4 à + 6",98,2.5499999999999998,2.0299999999999998,202,4.7,5.3]
[null,null,"Brebis  50 kg   Allaitante    Double      Semaines + 7 à + 10",99,2.0499999999999998,1.63,157,3.5,3.8]
[null,null,"Brebis  50 kg   Allaitante    Double      Semaines 0 à + 3 ",97,2,2.2799999999999998,227,5.2,5.9]
[null,null,"Brebis  50 kg   Allaitante    Simple      Semaines + 4 à + 6",95,1.95,1.33,127,3,3.2]
[null,null,"Brebis  50 kg   Allaitante    Simple      Semaines + 7 à + 10",96,1.7,1.18,107,2.7,3.5]
[null,null,"Brebis  50 kg   Allaitante    Simple      Semaines 0 à + 3 ",94,1.52,1.53,147,3.4,3.7]
[null,null,"Brebis  50 kg   Allaitante    Triple      Semaines + 4 à + 6",null,"ND","ND","ND","ND","ND"]
[null,null,"Brebis  50 kg   Allaitante    Triple      Semaines + 7 à + 10",null,"ND","ND","ND","ND","ND"]
[null,null,"Brebis  50 kg   Allaitante    Triple      Semaines 0 à + 3 ",null,"ND","ND","ND","ND","ND"]
[null,null,"Brebis  50 kg   Engrais    GMQ  50 g/j      Bon état (3 - 3.5)",null,1.5230442526999901,{"$f":"F219-0.08","v":0.88000000000000012},{"$f":"G219-7","v":55},1.3,1]
[null,null,"Brebis  50 kg   Engrais    GMQ  50 g/j      Etat moyen (2 - 2.5)",null,1.6734683764234499,0.83000000000000007,51,1.3,1]
[null,null,"Brebis  50 kg   Engrais    GMQ  50 g/j      Mauvais état (1 - 1.5)",null,1.8238925001469,0.79,48,1.3,1]
[null,null,"Brebis  50 kg   Engrais    GMQ 100 g/j      Bon état (3 - 3.5)",null,1.5230442526999901,1.1599999999999999,66,1.3,1]
[null,null,"Brebis  50 kg   Engrais    GMQ 100 g/j      Etat moyen (2 - 2.5)",null,1.6734683764234499,1.1099999999999999,62,1.3,1]
[null,null,"Brebis  50 kg   Engrais    GMQ 100 g/j      Mauvais état (1 - 1.5)",null,1.8238925001469,1.0699999999999998,59,1.3,1]
[null,null,"Brebis  50 kg   Engrais    GMQ 150 g/j      Bon état (3 - 3.5)",null,1.5230442526999901,1.44,77,1.3,1]
[null,null,"Brebis  50 kg   Engrais    GMQ 150 g/j      Etat moyen (2 - 2.5)",null,1.6734683764234499,1.39,73,1.3,1]
[null,null,"Brebis  50 kg   Engrais    GMQ 150 g/j      Mauvais état (1 - 1.5)",null,1.8238925001469,1.3499999999999999,70,1.3,1]
[null,null,"Brebis  50 kg   Gestante    Double      Semaines - 2 à 0",63,1.2999999999999998,1.26,140,2.9000000000000004,3.8]
[null,null,"Brebis  50 kg   Gestante    Double      Semaines - 3 à - 4",62,1.2999999999999998,0.98,114,2.3000000000000003,2.5999999999999996]
[null,null,"Brebis  50 kg   Gestante    Double      Semaines - 5 à - 6",61,1.2999999999999998,0.77999999999999992,90,1.9999999999999998,2]
[null,null,"Brebis  50 kg   Gestante    Inconnu      Semaines - 2 à 0",66,1.23,1.1749999999999998,129,2.7,3.4]
[null,null,"Brebis  50 kg   Gestante    Inconnu      Semaines - 3 à - 4",65,1.23,0.93500000000000005,109,2.2000000000000002,2.3999999999999995]
[null,null,"Brebis  50 kg   Gestante    Inconnu      Semaines - 5 à - 6",64,1.23,0.77,85,1.95,1.85]
[null,null,"Brebis  50 kg   Gestante    Simple      Semaines - 2 à 0",60,1.1599999999999999,1.0899999999999999,118,2.5,3]
[null,null,"Brebis  50 kg   Gestante    Simple      Semaines - 3 à - 4",59,1.1599999999999999,0.89,104,2.1,2.1999999999999997]
[null,null,"Brebis  50 kg   Gestante    Simple      Semaines - 5 à - 6",58,1.1599999999999999,0.76,80,1.7,1.9]
[null,null,"Brebis  50 kg   Vide    Bon Etat (> 3,5)      Avec prise de poids + 150 g/j",29,1.4102261599073973,1.4604995103592548,80.007538663579908,1,1.3]
[null,null,"Brebis  50 kg   Vide    Bon Etat (> 3,5)      flushing + 100 g/j",30,1.4102261599073973,1.180499510359255,58.007538663579915,1,1.3]
[null,null,"Brebis  50 kg   Vide    Bon Etat (> 3,5)      Sans prise de poids - Entretien",28,1.4102261599073973,0.62049951035925488,47.007538663579915,1,1.3]
[null,null,"Brebis  50 kg   Vide    Etat Moyen (2,5 - 3,5)      Avec prise de poids + 150 g/j",26,1.5230442526999892,1.4604995103592548,80.007538663579908,1,1.3]
[null,null,"Brebis  50 kg   Vide    Etat Moyen (2,5 - 3,5)      flushing + 100 g/j",27,1.5230442526999892,1.180499510359255,58.007538663579915,1,1.3]
[null,null,"Brebis  50 kg   Vide    Etat Moyen (2,5 - 3,5)      Sans prise de poids - Entretien",25,1.5230442526999892,0.62049951035925488,47.007538663579915,1,1.3]
[null,null,"Brebis  50 kg   Vide    Mauvais Etat (< 2,5)      Avec prise de poids + 150 g/j",23,1.6734683764234448,1.4604995103592548,80.007538663579908,1,1.3]
[null,null,"Brebis  50 kg   Vide    Mauvais Etat (< 2,5)      flushing + 100 g/j",24,1.6734683764234448,1.180499510359255,58.007538663579915,1,1.3]
[null,null,"Brebis  50 kg   Vide    Mauvais Etat (< 2,5)      Sans prise de poids - Entretien",22,1.6734683764234448,0.62049951035925488,47.007538663579915,1,1.3]
[null,null,"Brebis  60 kg   Allaitante    Double      Semaines + 4 à + 6",104,2.75,2.11,209,5,5.5]
[null,null,"Brebis  60 kg   Allaitante    Double      Semaines + 7 à + 10",105,2.25,1.71,164,3.8,4]
[null,null,"Brebis  60 kg   Allaitante    Double      Semaines 0 à + 3 ",103,2.2000000000000002,2.36,234,5.5,6.1]
[null,null,"Brebis  60 kg   Allaitante    Simple      Semaines + 4 à + 6",101,2.15,1.41,134,3.3,3.4]
[null,null,"Brebis  60 kg   Allaitante    Simple      Semaines + 7 à + 10",102,1.9,1.26,114,2.8,2.7]
[null,null,"Brebis  60 kg   Allaitante    Simple      Semaines 0 à + 3 ",100,1.72,1.61,154,3.7,3.8]
[null,null,"Brebis  60 kg   Allaitante    Triple      Semaines + 4 à + 6",null,2.85,2.31,234,5.5,6.1]
[null,null,"Brebis  60 kg   Allaitante    Triple      Semaines + 7 à + 10",null,2.35,1.86,184,4.0999999999999996,4.3]
[null,null,"Brebis  60 kg   Allaitante    Triple      Semaines 0 à + 3 ",null,2.2999999999999998,2.65,364,6.1,6.9]
[null,null,"Brebis  60 kg   Engrais    GMQ  50 g/j      Bon état (3 - 3.5)",null,1.74621798414059,{"$f":"F255-0.08","v":0.96000000000000008},{"$f":"G255-7","v":62},1.6,1.2]
[null,null,"Brebis  60 kg   Engrais    GMQ  50 g/j      Etat moyen (2 - 2.5)",null,1.9186839578828701,0.91,58,1.6,1.2]
[null,null,"Brebis  60 kg   Engrais    GMQ  50 g/j      Mauvais état (1 - 1.5)",null,2.0911499316251501,0.87,55,1.6,1.2]
[null,null,"Brebis  60 kg   Engrais    GMQ 100 g/j      Bon état (3 - 3.5)",null,1.74621798414059,1.24,73,1.6,1.2]
[null,null,"Brebis  60 kg   Engrais    GMQ 100 g/j      Etat moyen (2 - 2.5)",null,1.9186839578828701,1.19,69,1.6,1.2]
[null,null,"Brebis  60 kg   Engrais    GMQ 100 g/j      Mauvais état (1 - 1.5)",null,2.0911499316251501,1.1499999999999999,66,1.6,1.2]
[null,null,"Brebis  60 kg   Engrais    GMQ 150 g/j      Bon état (3 - 3.5)",null,1.74621798414059,1.52,84,1.6,1.2]
[null,null,"Brebis  60 kg   Engrais    GMQ 150 g/j      Etat moyen (2 - 2.5)",null,1.9186839578828701,1.47,80,1.6,1.2]
[null,null,"Brebis  60 kg   Engrais    GMQ 150 g/j      Mauvais état (1 - 1.5)",null,2.0911499316251501,1.43,77,1.6,1.2]
[null,null,"Brebis  60 kg   Gestante    Double      Semaines - 2 à 0",72,1.4,1.3,143,3.2,4]
[null,null,"Brebis  60 kg   Gestante    Double      Semaines - 3 à - 4",71,1.4,1.02,117,2.6,2.8]
[null,null,"Brebis  60 kg   Gestante    Double      Semaines - 5 à - 6",70,1.4,0.82,93,2.2999999999999998,2.2000000000000002]
[null,null,"Brebis  60 kg   Gestante    Inconnu      Semaines - 2 à 0",75,1.33,1.2149999999999999,132,3,3.6]
[null,null,"Brebis  60 kg   Gestante    Inconnu      Semaines - 3 à - 4",74,1.33,0.97500000000000009,112,2.5,2.5999999999999996]
[null,null,"Brebis  60 kg   Gestante    Inconnu      Semaines - 5 à - 6",73,1.33,0.81,88,2.25,2.0499999999999998]
[null,null,"Brebis  60 kg   Gestante    Simple      Semaines - 2 à 0",69,1.26,1.1299999999999999,121,2.8,3.2]
[null,null,"Brebis  60 kg   Gestante    Simple      Semaines - 3 à - 4",68,1.26,0.93,107,2.4,2.4]
[null,null,"Brebis  60 kg   Gestante    Simple      Semaines - 5 à - 6",67,1.26,0.8,83,1.9,2.2000000000000002]
[null,null,"Brebis  60 kg   Vide    Bon Etat (> 3,5)      Avec prise de poids + 150 g/j",38,1.6168685038338781,1.5514221416869063,86.895616794462597,1.2,1.5599999999999998]
[null,null,"Brebis  60 kg   Vide    Bon Etat (> 3,5)      flushing + 100 g/j",39,1.6168685038338781,1.2714221416869065,64.895616794462597,1.2,1.5599999999999998]
[null,null,"Brebis  60 kg   Vide    Bon Etat (> 3,5)      Sans prise de poids - Entretien",37,1.6168685038338781,0.71142214168690643,53.895616794462605,1.2,1.5599999999999998]
[null,null,"Brebis  60 kg   Vide    Etat Moyen (2,5 - 3,5)      Avec prise de poids + 150 g/j",35,1.7462179841405885,1.5514221416869063,86.895616794462597,1.2,1.5599999999999998]
[null,null,"Brebis  60 kg   Vide    Etat Moyen (2,5 - 3,5)      flushing + 100 g/j",36,1.7462179841405885,1.2714221416869065,64.895616794462597,1.2,1.5599999999999998]
[null,null,"Brebis  60 kg   Vide    Etat Moyen (2,5 - 3,5)      Sans prise de poids - Entretien",34,1.7462179841405885,0.71142214168690643,53.895616794462605,1.2,1.5599999999999998]
[null,null,"Brebis  60 kg   Vide    Mauvais Etat (< 2,5)      Avec prise de poids + 150 g/j",32,1.9186839578828687,1.5514221416869063,86.895616794462597,1.2,1.5599999999999998]
[null,null,"Brebis  60 kg   Vide    Mauvais Etat (< 2,5)      flushing + 100 g/j",33,1.9186839578828687,1.2714221416869065,64.895616794462597,1.2,1.5599999999999998]
[null,null,"Brebis  60 kg   Vide    Mauvais Etat (< 2,5)      Sans prise de poids - Entretien",31,1.9186839578828687,0.71142214168690643,53.895616794462605,1.2,1.5599999999999998]
[null,null,"Brebis  70 kg   Allaitante    Double      Semaines + 4 à + 6",110,2.95,2.19,216,5.2,6.1]
[null,null,"Brebis  70 kg   Allaitante    Double      Semaines + 7 à + 10",111,2.4500000000000002,1.79,171,4,4.5999999999999996]
[null,null,"Brebis  70 kg   Allaitante    Double      Semaines 0 à + 3 ",109,2.4000000000000004,2.44,241,5.7,6.3]
[null,null,"Brebis  70 kg   Allaitante    Simple      Semaines + 4 à + 6",107,2.35,1.49,141,3.5,3.6]
[null,null,"Brebis  70 kg   Allaitante    Simple      Semaines + 7 à + 10",108,2.1,1.35,121,3,2.9]
[null,null,"Brebis  70 kg   Allaitante    Simple      Semaines 0 à + 3 ",106,1.92,1.67,161,3.9,4.4000000000000004]
[null,null,"Brebis  70 kg   Allaitante    Triple      Semaines + 4 à + 6",null,3.05,2.39,241,5.7,6.3]
[null,null,"Brebis  70 kg   Allaitante    Triple      Semaines + 7 à + 10",null,1.95,1.89,181,4.3,4.5]
[null,null,"Brebis  70 kg   Allaitante    Triple      Semaines 0 à + 3 ",null,2.44,2.74,271,6.3,7.5]
[null,null,"Brebis  70 kg   Engrais    GMQ  50 g/j      Bon état (3 - 3.5)",null,1.9602368489198101,{"$f":"F258-0.28","v":1.04},{"$f":"G258-11","v":69},1.8,1.4]
[null,null,"Brebis  70 kg   Engrais    GMQ  50 g/j      Etat moyen (2 - 2.5)",null,2.1538404883192901,{"$f":"F259-0.28","v":0.99},{"$f":"G259-11","v":65},1.8,1.4]
[null,null,"Brebis  70 kg   Engrais    GMQ  50 g/j      Mauvais état (1 - 1.5)",null,2.3474441277187799,{"$f":"F260-0.28","v":0.95},{"$f":"G260-11","v":62},1.8,1.4]
[null,null,"Brebis  70 kg   Engrais    GMQ 100 g/j      Bon état (3 - 3.5)",null,1.9602368489198101,1.32,80,1.8,1.4]
[null,null,"Brebis  70 kg   Engrais    GMQ 100 g/j      Etat moyen (2 - 2.5)",null,2.1538404883192901,1.27,76,1.8,1.4]
[null,null,"Brebis  70 kg   Engrais    GMQ 100 g/j      Mauvais état (1 - 1.5)",null,2.3474441277187799,1.23,73,1.8,1.4]
[null,null,"Brebis  70 kg   Engrais    GMQ 150 g/j      Bon état (3 - 3.5)",null,1.9602368489198101,{"$f":"F258+0.28","v":1.6},{"$f":"G258+11","v":91},1.8,1.4]
[null,null,"Brebis  70 kg   Engrais    GMQ 150 g/j      Etat moyen (2 - 2.5)",null,2.1538404883192901,{"$f":"F259+0.28","v":1.55},{"$f":"G259+11","v":87},1.8,1.4]
[null,null,"Brebis  70 kg   Engrais    GMQ 150 g/j      Mauvais état (1 - 1.5)",null,2.3474441277187799,{"$f":"F260+0.28","v":1.51},{"$f":"G260+11","v":84},1.8,1.4]
[null,null,"Brebis  70 kg   Gestante    Double      Semaines - 2 à 0",81,1.71,1.5,172,3.9,5]
[null,null,"Brebis  70 kg   Gestante    Double      Semaines - 3 à - 4",80,1.71,1.1399999999999999,146,3.2,3.5]
[null,null,"Brebis  70 kg   Gestante    Double      Semaines - 5 à - 6",79,1.71,0.93,111,2.8,2.7]
[null,null,"Brebis  70 kg   Gestante    Inconnu      Semaines - 2 à 0",84,1.6749999999999998,1.36,150.5,3.5,4.1500000000000004]
[null,null,"Brebis  70 kg   Gestante    Inconnu      Semaines - 3 à - 4",83,1.6749999999999998,1.08,130,2.95,3.05]
[null,null,"Brebis  70 kg   Gestante    Inconnu      Semaines - 5 à - 6",82,1.6749999999999998,0.90500000000000003,100.5,2.65,2.4000000000000004]
[null,null,"Brebis  70 kg   Gestante    Simple      Semaines - 2 à 0",78,1.64,1.22,129,3.1,3.3]
[null,null,"Brebis  70 kg   Gestante    Simple      Semaines - 3 à - 4",77,1.64,1.02,114,2.7,2.6]
[null,null,"Brebis  70 kg   Gestante    Simple      Semaines - 5 à - 6",76,1.64,0.88,90,2.5,2.1]
[null,null,"Brebis  70 kg   Vide    Bon Etat (> 3,5)      Avec prise de poids + 150 g/j",47,1.8150341193701911,1.6386150125228842,93.501137312339708,1.4000000000000001,1.8199999999999998]
[null,null,"Brebis  70 kg   Vide    Bon Etat (> 3,5)      flushing + 100 g/j",48,1.8150341193701911,1.3586150125228842,71.501137312339708,1.4000000000000001,1.8199999999999998]
[null,null,"Brebis  70 kg   Vide    Bon Etat (> 3,5)      Sans prise de poids - Entretien",46,1.8150341193701911,0.79861501252288414,60.501137312339708,1.4000000000000001,1.8199999999999998]
[null,null,"Brebis  70 kg   Vide    Etat Moyen (2,5 - 3,5)      Avec prise de poids + 150 g/j",44,1.9602368489198065,1.6386150125228842,93.501137312339708,1.4000000000000001,1.8199999999999998]
[null,null,"Brebis  70 kg   Vide    Etat Moyen (2,5 - 3,5)      flushing + 100 g/j",45,1.9602368489198065,1.3586150125228842,71.501137312339708,1.4000000000000001,1.8199999999999998]
[null,null,"Brebis  70 kg   Vide    Etat Moyen (2,5 - 3,5)      Sans prise de poids - Entretien",43,1.9602368489198065,0.79861501252288414,60.501137312339708,1.4000000000000001,1.8199999999999998]
[null,null,"Brebis  70 kg   Vide    Mauvais Etat (< 2,5)      Avec prise de poids + 150 g/j",41,2.1538404883192936,1.6386150125228842,93.501137312339708,1.4000000000000001,1.8199999999999998]
[null,null,"Brebis  70 kg   Vide    Mauvais Etat (< 2,5)      flushing + 100 g/j",42,2.1538404883192936,1.3586150125228842,71.501137312339708,1.4000000000000001,1.8199999999999998]
[null,null,"Brebis  70 kg   Vide    Mauvais Etat (< 2,5)      Sans prise de poids - Entretien",40,2.1538404883192936,0.79861501252288414,60.501137312339708,1.4000000000000001,1.8199999999999998]
[null,null,"Brebis  80 kg   Allaitante    Double      Semaines + 4 à + 6",116,3.15,2.27,223,5.5,5.9]
[null,null,"Brebis  80 kg   Allaitante    Double      Semaines + 7 à + 10",117,2.65,1.87,178,4.3,4.4000000000000004]
[null,null,"Brebis  80 kg   Allaitante    Double      Semaines 0 à + 3 ",115,2.6,2.5099999999999998,248,6,6.5]
[null,null,"Brebis  80 kg   Allaitante    Simple      Semaines + 4 à + 6",113,2.5499999999999998,1.57,148,3.8,3.8]
[null,null,"Brebis  80 kg   Allaitante    Simple      Semaines + 7 à + 10",114,2.2999999999999998,1.43,128,3.3,2.9]
[null,null,"Brebis  80 kg   Allaitante    Simple      Semaines 0 à + 3 ",112,2.12,1.75,168,4.2,4.3]
[null,null,"Brebis  80 kg   Allaitante    Triple      Semaines + 4 à + 6",null,3.45,2.4700000000000002,248,6,6.5]
[null,null,"Brebis  80 kg   Allaitante    Triple      Semaines + 7 à + 10",null,2.75,2.02,198,4.5999999999999996,4.7]
[null,null,"Brebis  80 kg   Allaitante    Triple      Semaines 0 à + 3 ",null,2.84,2.81,278,6.6,7.3]
[null,null,"Brebis  80 kg   Engrais    GMQ  50 g/j      Bon état (3 - 3.5)",null,2.1667185881236102,{"$f":"F255+0.08","v":1.1200000000000001},{"$f":"G255+7","v":76},2.1,1.6]
[null,null,"Brebis  80 kg   Engrais    GMQ  50 g/j      Etat moyen (2 - 2.5)",null,2.3807154857160602,1.07,72,2.1,1.6]
[null,null,"Brebis  80 kg   Engrais    GMQ  50 g/j      Mauvais état (1 - 1.5)",null,2.5947123833085199,1.03,69,2.1,1.6]
[null,null,"Brebis  80 kg   Engrais    GMQ 100 g/j      Bon état (3 - 3.5)",null,2.1667185881236102,1.4000000000000001,87,2.1,1.6]
[null,null,"Brebis  80 kg   Engrais    GMQ 100 g/j      Etat moyen (2 - 2.5)",null,2.3807154857160602,1.35,83,2.1,1.6]
[null,null,"Brebis  80 kg   Engrais    GMQ 100 g/j      Mauvais état (1 - 1.5)",null,2.5947123833085199,1.31,80,2.1,1.6]
[null,null,"Brebis  80 kg   Engrais    GMQ 150 g/j      Bon état (3 - 3.5)",null,2.1667185881236102,1.6800000000000002,98,2.1,1.6]
[null,null,"Brebis  80 kg   Engrais    GMQ 150 g/j      Etat moyen (2 - 2.5)",null,2.3807154857160602,1.6300000000000001,94,2.1,1.6]
[null,null,"Brebis  80 kg   Engrais    GMQ 150 g/j      Mauvais état (1 - 1.5)",null,2.5947123833085199,1.59,91,2.1,1.6]
[null,null,"Brebis  80 kg   Gestante    Double      Semaines - 2 à 0",90,1.81,1.54,175,4.2,5.2]
[null,null,"Brebis  80 kg   Gestante    Double      Semaines - 3 à - 4",89,1.81,1.18,149,3.5,3.7]
[null,null,"Brebis  80 kg   Gestante    Double      Semaines - 5 à - 6",88,1.81,0.97000000000000008,114,3.0999999999999996,2.9000000000000004]
[null,null,"Brebis  80 kg   Gestante    Inconnu      Semaines - 2 à 0",93,1.7749999999999999,1.4,153.5,3.8,4.3499999999999996]
[null,null,"Brebis  80 kg   Gestante    Inconnu      Semaines - 3 à - 4",92,1.7749999999999999,1.1200000000000001,133,3.25,3.25]
[null,null,"Brebis  80 kg   Gestante    Inconnu      Semaines - 5 à - 6",91,1.7749999999999999,0.94499999999999995,103.5,2.95,2.6000000000000005]
[null,null,"Brebis  80 kg   Gestante    Simple      Semaines - 2 à 0",87,1.74,1.26,132,3.4,3.5]
[null,null,"Brebis  80 kg   Gestante    Simple      Semaines - 3 à - 4",86,1.74,1.06,117,3,2.8]
[null,null,"Brebis  80 kg   Gestante    Simple      Semaines - 5 à - 6",85,1.74,0.92,93,2.8,2.3000000000000003]
[null,null,"Brebis  80 kg   Vide    Bon Etat (> 3,5)      Avec prise de poids + 150 g/j",56,2.0062209149292656,1.7227372025688767,99.874030497642181,1.6,2.08]
[null,null,"Brebis  80 kg   Vide    Bon Etat (> 3,5)      flushing + 100 g/j",57,2.0062209149292656,1.4427372025688769,77.874030497642181,1.6,2.08]
[null,null,"Brebis  80 kg   Vide    Bon Etat (> 3,5)      Sans prise de poids - Entretien",55,2.0062209149292656,0.88273720256887689,66.874030497642181,1.6,2.08]
[null,null,"Brebis  80 kg   Vide    Etat Moyen (2,5 - 3,5)      Avec prise de poids + 150 g/j",53,2.1667185881236066,1.7227372025688767,99.874030497642181,1.6,2.08]
[null,null,"Brebis  80 kg   Vide    Etat Moyen (2,5 - 3,5)      flushing + 100 g/j",54,2.1667185881236066,1.4427372025688769,77.874030497642181,1.6,2.08]
[null,null,"Brebis  80 kg   Vide    Etat Moyen (2,5 - 3,5)      Sans prise de poids - Entretien",52,2.1667185881236066,0.88273720256887689,66.874030497642181,1.6,2.08]
[null,null,"Brebis  80 kg   Vide    Mauvais Etat (< 2,5)      Avec prise de poids + 150 g/j",50,2.3807154857160615,1.7227372025688767,99.874030497642181,1.6,2.08]
[null,null,"Brebis  80 kg   Vide    Mauvais Etat (< 2,5)      flushing + 100 g/j",51,2.3807154857160615,1.4427372025688769,77.874030497642181,1.6,2.08]
[null,null,"Brebis  80 kg   Vide    Mauvais Etat (< 2,5)      Sans prise de poids - Entretien",49,2.3807154857160615,0.88273720256887689,66.874030497642181,1.6,2.08]
[null,null,"Brebis  90 kg   Allaitante    Double      Semaines + 4 à + 6",116,"ND","ND","ND","ND","ND"]
[null,null,"Brebis  90 kg   Allaitante    Double      Semaines + 7 à + 10",117,"ND","ND","ND","ND","ND"]
[null,null,"Brebis  90 kg   Allaitante    Double      Semaines 0 à + 3 ",115,"ND","ND","ND","ND","ND"]
[null,null,"Brebis  90 kg   Allaitante    Simple      Semaines + 4 à + 6",113,"ND","ND","ND","ND","ND"]
[null,null,"Brebis  90 kg   Allaitante    Simple      Semaines + 7 à + 10",114,"ND","ND","ND","ND","ND"]
[null,null,"Brebis  90 kg   Allaitante    Simple      Semaines 0 à + 3 ",112,"ND","ND","ND","ND","ND"]
[null,null,"Brebis  90 kg   Allaitante    Triple      Semaines + 4 à + 6",null,"ND","ND","ND","ND","ND"]
[null,null,"Brebis  90 kg   Allaitante    Triple      Semaines + 7 à + 10",null,"ND","ND","ND","ND","ND"]
[null,null,"Brebis  90 kg   Allaitante    Triple      Semaines 0 à + 3 ",null,"ND","ND","ND","ND","ND"]
[null,null,"Brebis  90 kg   Gestante    Double      Semaines - 2 à 0",90,"ND","ND","ND","ND","ND"]
[null,null,"Brebis  90 kg   Gestante    Double      Semaines - 3 à - 4",89,"ND","ND","ND","ND","ND"]
[null,null,"Brebis  90 kg   Gestante    Double      Semaines - 5 à - 6",88,"ND","ND","ND","ND","ND"]
[null,null,"Brebis  90 kg   Gestante    Inconnu      Semaines - 2 à 0",93,"ND","ND","ND","ND","ND"]
[null,null,"Brebis  90 kg   Gestante    Inconnu      Semaines - 3 à - 4",92,"ND","ND","ND","ND","ND"]
[null,null,"Brebis  90 kg   Gestante    Inconnu      Semaines - 5 à - 6",91,"ND","ND","ND","ND","ND"]
[null,null,"Brebis  90 kg   Gestante    Simple      Semaines - 2 à 0",87,"ND","ND","ND","ND","ND"]
[null,null,"Brebis  90 kg   Gestante    Simple      Semaines - 3 à - 4",86,"ND","ND","ND","ND","ND"]
[null,null,"Brebis  90 kg   Gestante    Simple      Semaines - 5 à - 6",85,"ND","ND","ND","ND","ND"]
[null,null,"Brebis  90 kg   Vide    Bon Etat (> 3,5)      Avec prise de poids + 150 g/j",56,"ND","ND","ND","ND","ND"]
[null,null,"Brebis  90 kg   Vide    Bon Etat (> 3,5)      flushing + 100 g/j",57,"ND","ND","ND","ND","ND"]
[null,null,"Brebis  90 kg   Vide    Bon Etat (> 3,5)      Sans prise de poids - Entretien",55,"ND","ND","ND","ND","ND"]
[null,null,"Brebis  90 kg   Vide    Etat Moyen (2,5 - 3,5)      Avec prise de poids + 150 g/j",53,"ND","ND","ND","ND","ND"]
[null,null,"Brebis  90 kg   Vide    Etat Moyen (2,5 - 3,5)      flushing + 100 g/j",54,"ND","ND","ND","ND","ND"]
[null,null,"Brebis  90 kg   Vide    Etat Moyen (2,5 - 3,5)      Sans prise de poids - Entretien",52,"ND","ND","ND","ND","ND"]
[null,null,"Brebis  90 kg   Vide    Mauvais Etat (< 2,5)      Avec prise de poids + 150 g/j",50,"ND","ND","ND","ND","ND"]
[null,null,"Brebis  90 kg   Vide    Mauvais Etat (< 2,5)      flushing + 100 g/j",51,"ND","ND","ND","ND","ND"]
[null,null,"Brebis  90 kg   Vide    Mauvais Etat (< 2,5)      Sans prise de poids - Entretien",49,"ND","ND","ND","ND","ND"]
[null,null,"Brebis traite  100 kg   0,5 l/jour          ",null,"ND","ND","ND","ND","ND"]
[null,null,"Brebis traite  100 kg   1,0 l/jour          ",null,"ND","ND","ND","ND","ND"]
[null,null,"Brebis traite  100 kg   1,5 l/jour          ",null,"ND","ND","ND","ND","ND"]
[null,null,"Brebis traite  100 kg   2,0 l/jour          ",null,"ND","ND","ND","ND","ND"]
[null,null,"Brebis traite  100 kg   2,5 l/jour          ",null,"ND","ND","ND","ND","ND"]
[null,null,"Brebis traite  100 kg   3,0 l/jour          ",null,"ND","ND","ND","ND","ND"]
[null,null,"Brebis traite  30 kg   1,0 l/jour          ",null,"ND","ND","ND","ND","ND"]
[null,null,"Brebis traite  30 kg   1,5 l/jour          ",null,"ND","ND","ND","ND","ND"]
[null,null,"Brebis traite  30 kg   2,0 l/jour          ",null,"ND","ND","ND","ND","ND"]
[null,null,"Brebis traite  30 kg   2,5 l/jour          ",null,"ND","ND","ND","ND","ND"]
[null,null,"Brebis traite  30 kg   3,0 l/jour          ",null,"ND","ND","ND","ND","ND"]
[null,null,"Brebis traite  40 kg   0,5 l/jour          ",null,"ND","ND","ND","ND","ND"]
[null,null,"Brebis traite  40 kg   0,5 l/jour          ",null,"ND","ND","ND","ND","ND"]
[null,null,"Brebis traite  40 kg   1,0 l/jour          ",null,"ND","ND","ND","ND","ND"]
[null,null,"Brebis traite  40 kg   1,5 l/jour          ",null,"ND","ND","ND","ND","ND"]
[null,null,"Brebis traite  40 kg   2,0 l/jour          ",null,"ND","ND","ND","ND","ND"]
[null,null,"Brebis traite  40 kg   2,5 l/jour          ",null,"ND","ND","ND","ND","ND"]
[null,null,"Brebis traite  40 kg   3,0 l/jour          ",null,"ND","ND","ND","ND","ND"]
[null,null,"Brebis traite  50 kg   0,5 l/jour          ",null,{"$f":"E369-0.24","v":1.76},{"$f":"F369-0.24","v":0.76},{"$f":"G369-0.24","v":113.52000000000001},{"$f":"H369-0.24","v":2.62},{"$f":"I369-0.24","v":1.9200000000000002}]
[null,null,"Brebis traite  50 kg   1,0 l/jour          ",null,{"$f":"E370-0.24","v":2.2299999999999995},{"$f":"F370-0.08","v":1.45},{"$f":"G370-7","v":150},{"$f":"H370-0.2","v":3.3999999999999995},{"$f":"I370-0.3","v":2.7}]
[null,null,"Brebis traite  50 kg   1,5 l/jour          ",null,2.67,{"$f":"F371-0.08","v":1.7899999999999998},{"$f":"G371-7","v":199},{"$f":"H371-0.2","v":4.1999999999999993},{"$f":"I371-0.3","v":3.7}]
[null,null,"Brebis traite  50 kg   2,0 l/jour          ",null,2.9399999999999995,{"$f":"F372-0.08","v":2.0099999999999998},{"$f":"G372-7","v":233},{"$f":"H372-0.2","v":4.8999999999999995},{"$f":"I372-0.3","v":4.6000000000000005}]
[null,null,"Brebis traite  50 kg   2,5 l/jour          ",null,3.1399999999999997,{"$f":"F373-0.08","v":2.17},{"$f":"G373-7","v":254},{"$f":"H373-0.2","v":5.6999999999999993},{"$f":"I373-0.3","v":5.6000000000000005}]
[null,null,"Brebis traite  50 kg   3,0 l/jour          ",null,3.4299999999999997,{"$f":"F374-0.08","v":2.4},{"$f":"G374-7","v":281},{"$f":"H374-0.2","v":6.3999999999999995},{"$f":"I374-0.3","v":6.5}]
[null,null,"Brebis traite  60 kg   0,5 l/jour          ",null,2,{"$f":"F375-0.24","v":1},{"$f":"G375-0.24","v":113.76},{"$f":"H375-0.24","v":2.8600000000000003},{"$f":"I375-0.24","v":2.16}]
[null,null,"Brebis traite  60 kg   1,0 l/jour          ",null,2.4699999999999998,{"$f":"F376-0.08","v":1.53},{"$f":"G376-7","v":157},{"$f":"H376-0.2","v":3.5999999999999996},{"$f":"I376-0.3","v":3}]
[null,null,"Brebis traite  60 kg   1,5 l/jour          ",null,2.91,{"$f":"F377-0.08","v":1.8699999999999999},{"$f":"G377-7","v":206},{"$f":"H377-0.2","v":4.3999999999999995},{"$f":"I377-0.3","v":4}]
[null,null,"Brebis traite  60 kg   2,0 l/jour          ",null,3.1799999999999997,{"$f":"F378-0.08","v":2.09},{"$f":"G378-7","v":240},{"$f":"H378-0.2","v":5.0999999999999996},{"$f":"I378-0.3","v":4.9000000000000004}]
[null,null,"Brebis traite  60 kg   2,5 l/jour          ",null,3.38,{"$f":"F379-0.08","v":2.25},{"$f":"G379-7","v":261},{"$f":"H379-0.2","v":5.8999999999999995},{"$f":"I379-0.3","v":5.9}]
[null,null,"Brebis traite  60 kg   3,0 l/jour          ",null,3.67,{"$f":"F380-0.08","v":2.48},{"$f":"G380-7","v":288},{"$f":"H380-0.2","v":6.6},{"$f":"I380-0.3","v":6.8}]
[null,null,"Brebis traite  70 kg   0,5 l/jour          ",null,2.2400000000000002,1.24,114,3.1,2.4]
[null,null,"Brebis traite  70 kg   1,0 l/jour          ",null,2.71,1.61,164,3.8,3.3]
[null,null,"Brebis traite  70 kg   1,5 l/jour          ",null,3.15,1.95,213,4.5999999999999996,4.3]
[null,null,"Brebis traite  70 kg   2,0 l/jour          ",null,3.42,2.17,247,5.3,5.2]
[null,null,"Brebis traite  70 kg   2,5 l/jour          ",null,3.62,2.33,268,6.1,6.2]
[null,null,"Brebis traite  70 kg   3,0 l/jour          ",null,3.91,2.56,295,6.8,7.1]
[null,null,"Brebis traite  80 kg   0,5 l/jour          ",null,{"$f":"E375+0.24","v":2.4800000000000004},{"$f":"F375+0.08","v":1.32},{"$f":"G375+7","v":121},{"$f":"H375+0.2","v":3.3000000000000003},{"$f":"I375+0.3","v":2.6999999999999997}]
[null,null,"Brebis traite  80 kg   1,0 l/jour          ",null,2.95,1.6900000000000002,171,4,3.5999999999999996]
[null,null,"Brebis traite  80 kg   1,5 l/jour          ",null,3.3899999999999997,2.0299999999999998,220,4.8,4.5999999999999996]
[null,null,"Brebis traite  80 kg   2,0 l/jour          ",null,3.66,2.25,254,5.5,5.5]
[null,null,"Brebis traite  80 kg   2,5 l/jour          ",null,3.8600000000000003,2.41,275,6.3,6.5]
[null,null,"Brebis traite  80 kg   3,0 l/jour          ",null,4.1500000000000004,2.64,302,7,7.3999999999999995]
[null,null,"Brebis traite  90 kg   0,5 l/jour          ",null,"ND","ND","ND","ND","ND"]
[null,null,"Brebis traite  90 kg   1,0 l/jour          ",null,"ND","ND","ND","ND","ND"]
[null,null,"Brebis traite  90 kg   1,5 l/jour          ",null,"ND","ND","ND","ND","ND"]
[null,null,"Brebis traite  90 kg   2,0 l/jour          ",null,"ND","ND","ND","ND","ND"]
[null,null,"Brebis traite  90 kg   2,5 l/jour          ",null,"ND","ND","ND","ND","ND"]
[null,null,"Brebis traite  90 kg   3,0 l/jour          ",null,"ND","ND","ND","ND","ND"]

{"sheet":"FOURRAGE","index":5,"n_rows":434,"n_cols":22,"rows_kept":434,"cut":false,"hidden":false,"merged":[[26,14,26,15],[26,16,26,17],[32,1,33,4],[27,14,29,17],[22,16,22,17],[22,14,22,15],[33,9,33,10],[32,6,32,7],[32,9,32,11],[28,9,28,10],[27,9,27,10],[26,4,26,11],[20,14,21,17],[24,15,25,17],[3,7,3,17],[1,1,1,17],[22,4,24,9],[13,9,13,10],[14,9,14,10],[20,10,22,12],[19,4,21,9],[23,11,24,11],[20,1,21,3],[13,16,14,16],[9,16,10,17],[13,14,15,15],[12,4,12,11],[9,11,10,11],[4,1,4,12],[11,16,12,16],[11,14,12,15],[0,1,0,17],[8,14,9,15],[10,14,10,15],[6,14,7,17],[5,4,7,9],[8,4,10,9],[7,1,7,3],[5,1,5,3],[5,10,7,12]]}
[null,"ALIM'ovins(v. 5.1) "]
[null,"Rationnement des ovins"]
[]
[null,null,null,null,null,null,null,"Ration"]
[null,"                   zone de Plaine (Normandie)                zone de Demi-montagne (Auvergne)"]
[null,null,null,null,"FOURRAGE N° 1                              (Rationné ou à volonté)",null,null,null,null,null,"2 Saisissez les quantités brutes ou cliquez A VOLONTE"]
[null,null,null,null,null,null,null,null,null,null,null,null,null,null,{"$f":"IF(ANIMAL!C8=\"\",\"\",IF(O11>1,\"ATTENTION ! La capacité d'ingestion est dépassée\",IF(C9=\"\",\"\",IF(V7<0.02,\"La capacité d'ingestion est atteinte\",\"La capacité d'ingestion n'est pas atteinte\"))))","v":""},null,null,null,null,null,{"$f":"ANIMAL!E16","v":""},{"$f":"IF(O11>1,0,1-V9-V8)","v":0}]
[null,"                1 Cliquez sur les flèches pour faire votre choix",null,null,null,null,null,null,null,null,null,null,null,null,null,null,null,null,null,null,{"$f":"IF(C23=\"\",0,L24*(E29/100)*F29)","v":0},{"$f":"IF(O11>1,0,U8/U7)","v":0}]
[null,"Catégorie fourrage",null,null,{"$f":"CONCATENATE(C9,\"    \",C11,\"    \",C13,\"  \",C15)","v":"          "},null,null,null,null,null,null,null,null,null,"Capacité d'ingestion",null,null,null,null,{"$f":"U12/U7","v":{"$error":"#VALUE!"}},{"$f":"IF(C9=\"\",0,(L10*(E15/100)*F15))","v":0},{"$f":"IF(O11>1,0,U9/U7)","v":0}]
[null,null,null,null,null,null,null,null,null,null,null,null,null,null,null,null,{"$f":"IF(O11=\"\",\"\",IF(O11>1,\"Réduisez les fourrages !\",\"\"))","v":""}]
[null,"Espèce végétale",null,null,null,null,null,null,null,null,null,null,null,null,{"$f":"IF(C9=\"\",\"\",T9)","v":""}]
[null,null,null,null,null,null,null,null,null,null,null,null,null,null,{"$f":"IF(C23=\"\",\"\",C23)","v":""},null,{"$f":"IF(C23=\"\",\"\",2)","v":""},null,null,null,{"$f":"U9+U8","v":0},{"$f":"U12/U7","v":{"$error":"#VALUE!"}}]
[null,"Conditions de récolte",null,null,"Valeurs Alimentaires"]
[null,null,null,null,"% M.S.","U.E.M.","U.F.L","P.D.I.N.","P.D.I.E.","Pabs",null,"Caabs",null,null,{"$f":"IF(C9=\"\",\"\",C9)","v":""},null,{"$f":"IF(C9=\"\",\"\",1)","v":""}]
[null,"Stade physiologique",null,null,{"$f":"IF(B42=1,IF(C9=\"\",\"\",IF(C9=\"Mon fourrage\",VLOOKUP($C$11,NOUVEAU!$E$22:$N30,3),VLOOKUP($E$9,$C$78:L246,2))),IF(C9=\"\",\"\",IF(C9=\"Mon fourrage\",VLOOKUP($C$11,NOUVEAU!$E$22:$N30,3),VLOOKUP($E$9,$C$259:L433,2))))","v":""},{"$f":"IF(B42=1,IF(C9=\"\",\"\",IF(C9=\"Mon fourrage\",VLOOKUP($C$11,NOUVEAU!$E$22:$N30,4),VLOOKUP($E$9,$C$78:M246,3))),IF(C9=\"\",\"\",IF(C9=\"Mon fourrage\",VLOOKUP($C$11,NOUVEAU!$E$22:$N30,4),VLOOKUP($E$9,$C$259:M433,3))))","v":""},{"$f":"IF(B42=1,IF(C9=\"\",\"\",IF(C9=\"Mon fourrage\",VLOOKUP($C$11,NOUVEAU!$E$22:$N30,5),VLOOKUP($E$9,$C$78:N246,5))),IF(C9=\"\",\"\",IF(C9=\"Mon fourrage\",VLOOKUP($C$11,NOUVEAU!$E$22:$N30,5),VLOOKUP($E$9,$C$259:N433,5))))","v":""},{"$f":"IF(B42=1,IF(C9=\"\",\"\",IF(C9=\"Mon fourrage\",VLOOKUP($C$11,NOUVEAU!$E$22:$N30,7),VLOOKUP($E$9,$C$78:O246,7))),IF(C9=\"\",\"\",IF(C9=\"Mon fourrage\",VLOOKUP($C$11,NOUVEAU!$E$22:$N30,7),VLOOKUP($E$9,$C$259:O433,7))))","v":""},{"$f":"IF(B42=1,IF(C9=\"\",\"\",IF(C9=\"Mon fourrage\",VLOOKUP($C$11,NOUVEAU!$E$22:$N30,8),VLOOKUP($E$9,$C$78:P246,8))),IF(C9=\"\",\"\",IF(C9=\"Mon fourrage\",VLOOKUP($C$11,NOUVEAU!$E$22:$N30,8),VLOOKUP($E$9,$C$259:P433,8))))","v":""},{"$f":"IF(B42=1,IF(C9=\"\",\"\",IF(C9=\"Mon fourrage\",VLOOKUP($C$11,NOUVEAU!$E$22:$N30,9),VLOOKUP($E$9,$C$78:Q246,9))),IF(C9=\"\",\"\",IF(C9=\"Mon fourrage\",VLOOKUP($C$11,NOUVEAU!$E$22:$N30,9),VLOOKUP($E$9,$C$259:Q433,9))))","v":""},{"$f":"IF(B9=\"\",\"\",IF(B9=\"Mon fourrage\",VLOOKUP($C$11,NOUVEAU!$E$22:$N31,10),VLOOKUP($E$9,$C$78:R246,10)))","v":{"$error":"#N/A"}},{"$f":"IF(B42=1,IF(C9=\"\",\"\",IF(C9=\"Mon fourrage\",VLOOKUP($C$11,NOUVEAU!$E$22:$N30,10),VLOOKUP($E$9,$C$78:S246,10))),IF(C9=\"\",\"\",IF(C9=\"Mon fourrage\",VLOOKUP($C$11,NOUVEAU!$E$22:$N30,10),VLOOKUP($E$9,$C$259:S433,10))))","v":""}]
[null,null,null,null,"ND: non disponible"]
[]
[]
[]
[null,null,null,null,"FOURRAGE N° 2                     (Rationné)"]
[null,"               1 Cliquez sur les flèches pour faire votre choix",null,null,null,null,null,null,null,null,"3 Saisissez les quantités brutes ",null,null,null,"Densité énergétique de la ration minimale"]
[]
[null,"Catégorie fourrage",null,null,{"$f":"CONCATENATE(C23,\"    \",C25,\"    \",C27,\"  \",C29)","v":"          "},null,null,null,null,null,null,null,null,null,"DERm",null,{"$f":"IF(ANIMAL!C8=\"\",\"\",ANIMAL!F16/ANIMAL!E16)","v":""}]
[]
[null,"Espèce végétale",null,null,null,null,null,null,null,null,null,null,null,null,{"$f":"IF(C23=\"\",\"\",IF(Q23>Q27,\">\",\"<\"))","v":""},"Densité énergétique du fourrage"]
[]
[null,"Conditions de récolte",null,null,"Valeurs Alimentaires",null,null,null,null,null,null,null,null,null,"DEF",null,{"$f":"IF(C9=\"\",\"\",IF(L24=\"\",G15/F15,AVERAGE((G15/F1),(G29/F29))))","v":""}]
[null,null,null,null,"% M.S.","U.E.M","U.F.L","P.D.I.N.","P.D.I.E.","Pabs",null,"Caabs",null,null,{"$f":"IF(C9=\"\",\"\",IF(Q23>Q27,\"Il faut ajouter un concentré\",\"Un concentré n'est pas nécessaire\"))","v":""}]
[null,"Stade physiologique",null,null,{"$f":"IF(B42=1,IF(C23=\"\",\"\",IF(C23=\"Mon fourrage\",VLOOKUP($C$25,NOUVEAU!$E$22:$N30,3),VLOOKUP($E$23,$C$78:L246,2))),IF(C23=\"\",\"\",IF(C23=\"Mon fourrage\",VLOOKUP($C$25,NOUVEAU!$E$22:$N30,3),VLOOKUP($E$23,$C$259:L433,2))))","v":""},{"$f":"IF(B42=1,IF(C23=\"\",\"\",IF(C23=\"Mon fourrage\",VLOOKUP($C$25,NOUVEAU!$E$22:$N30,4),VLOOKUP($E$23,$C$78:M246,3))),IF(C23=\"\",\"\",IF(C23=\"Mon fourrage\",VLOOKUP($C$25,NOUVEAU!$E$22:$N30,4),VLOOKUP($E$23,$C$259:M433,3))))","v":""},{"$f":"IF(B42=1,IF(C23=\"\",\"\",IF(C23=\"Mon fourrage\",VLOOKUP($C$25,NOUVEAU!$E$22:$N30,5),VLOOKUP($E$23,$C$78:N246,5))),IF(C23=\"\",\"\",IF(C23=\"Mon fourrage\",VLOOKUP($C$25,NOUVEAU!$E$22:$N30,5),VLOOKUP($E$23,$C$259:N433,5))))","v":""},{"$f":"IF(B42=1,IF(C23=\"\",\"\",IF(C23=\"Mon fourrage\",VLOOKUP($C$25,NOUVEAU!$E$22:$N30,7),VLOOKUP($E$23,$C$78:O246,7))),IF(C23=\"\",\"\",IF(C23=\"Mon fourrage\",VLOOKUP($C$25,NOUVEAU!$E$22:$N30,7),VLOOKUP($E$23,$C$259:O433,7))))","v":""},{"$f":"IF(B42=1,IF(C23=\"\",\"\",IF(C23=\"Mon fourrage\",VLOOKUP($C$25,NOUVEAU!$E$22:$N30,8),VLOOKUP($E$23,$C$78:P246,8))),IF(C23=\"\",\"\",IF(C23=\"Mon fourrage\",VLOOKUP($C$25,NOUVEAU!$E$22:$N30,8),VLOOKUP($E$23,$C$259:P433,8))))","v":""},{"$f":"IF(B42=1,IF(C23=\"\",\"\",IF(C23=\"Mon fourrage\",VLOOKUP($C$25,NOUVEAU!$E$22:$N30,9),VLOOKUP($E$23,$C$78:Q246,9))),IF(C23=\"\",\"\",IF(C23=\"Mon fourrage\",VLOOKUP($C$25,NOUVEAU!$E$22:$N30,9),VLOOKUP($E$23,$C$259:Q433,9))))","v":""},null,{"$f":"IF(B42=1,IF(C23=\"\",\"\",IF(C23=\"Mon fourrage\",VLOOKUP($C$25,NOUVEAU!$E$22:$N30,10),VLOOKUP($E$23,$C$78:S246,10))),IF(C23=\"\",\"\",IF(C23=\"Mon fourrage\",VLOOKUP($C$25,NOUVEAU!$E$22:$N30,10),VLOOKUP($E$23,$C$259:S433,10))))","v":""}]
[null,null,null,null,"ND: non disponible"]
[]
[]
[]
[]
[]
[]
[]
[]
[]
[null,null,null,null,null,null,null,null,null,{"$f":"IF($C$9=\"Mon fourrage\",NOUVEAU!E22,IF($C$9=\"Paille\",Q40,IF($C$9=\"Ensilage\",L40,IF($C$9=\"Pâture\",S40,O40))))","v":"Prairie naturelle"},null,"Prairie naturelle",null,null,"Prairie naturelle",null,"Blé",null,"Pré ",null,"Déprimage"]
[null,{"$f":"IF(L24=\"\",0,L24*(E29/100)*F29)","v":0},null,null,null,null,null,null,null,{"$f":"IF($C$9=\"Mon fourrage\",NOUVEAU!E23,IF($C$9=\"Paille\",Q41,IF($C$9=\"Ensilage\",L41,IF($C$9=\"Pâture\",S41,O41))))","v":"Fétuque élevée"},null,"Fétuque",null,null,"Fétuque élevée",null,"Orge",null,"Colza fourrager",null,"Printemps"]
[null,1,null,null,{"$f":"IF($C$9=\"Mon Fourrage\",\"\",IF($C$9=\"Pâture\",\"Déprimage\",IF($C$9=\"Paille\",\"\",IF($C$11=\"Maïs\",\"\",L50))))","v":"1er cycle début épiaison (25/05)"},null,null,null,null,{"$f":"IF($C$9=\"Mon fourrage\",NOUVEAU!E24,IF($C$9=\"Paille\",Q42,IF($C$9=\"Ensilage\",L42,IF($C$9=\"Pâture\",S42,O42))))","v":"Luzerne-Dactyle"},null,"Luzerne-Dactyle",null,null,"Luzerne-Dactyle",null,"Triticale",null,"Betterave (distribuée)",null,"Fin Printemps"]
[null,null,"Foin",null,{"$f":"IF($C$9=\"Mon Fourrage\",\"\",IF($C$9=\"Pâture\",\"Printemps\",IF($C$9=\"Paille\",\"\",IF($C$11=\"Maïs\",\"\",L51))))","v":"1er cycle  épaison (10/06)"},null,null,null,null,{"$f":"IF($C$9=\"Mon fourrage\",NOUVEAU!E25,IF($C$9=\"Paille\",Q43,IF($C$9=\"Ensilage\",L43,IF($C$9=\"Pâture\",S43,O43))))","v":"Trèfle-Ray Grass"},null,"Trèfle-Ray Grass",null,null,"Trèfle-Ray Grass",null,"Avoine",null,"Vesce",null,"Repousses"]
[null,null,"Ensilage",null,{"$f":"IF($C$9=\"Mon Fourrage\",\"\",IF($C$9=\"Pâture\",\"Fin Printemps\",IF($C$9=\"Paille\",\"\",IF($C$11=\"Maïs\",\"\",L52))))","v":"1er cycle début floraison (20/06)"},null,null,null,null,{"$f":"IF($C$9=\"Mon fourrage\",NOUVEAU!E26,IF($C$9=\"Paille\",Q44,IF($C$9=\"Ensilage\",L44,IF($C$9=\"Pâture\",S44,O44))))","v":"Ray Grass Italien"},null,"Ray Grass Italien",null,null,"Ray Grass Italien",null,"Paille traitée Ammoniac",null,"Trèfle blanc",null," "]
[null,null,"Paille",null,{"$f":"IF($C$9=\"Mon Fourrage\",\"\",IF($C$9=\"Pâture\",\"Repousse\",IF($C$9=\"Paille\",\"\",IF($C$11=\"Maïs\",\"\",L53))))","v":"2ème cycle (regain)"},null,null,null,null,{"$f":"IF($C$9=\"Mon fourrage\",NOUVEAU!E27,IF($C$9=\"Paille\",Q45,IF($C$9=\"Ensilage\",L45,IF($C$9=\"Pâture\",S45,O45))))","v":"Luzerne"},null,"Luzerne",null,null,"Luzerne"," "," ",null,"Avoine",null," "]
[null,null,"Pâture",null,{"$f":"IF($C$9=\"Mon Fourrage\",\"\",IF($C$9=\"Pâture\",\"Dérobé\",IF($C$9=\"Paille\",\"\",IF($C$11=\"Maïs\",\"\",L54))))","v":" "},null,null,null,null,{"$f":"IF($C$9=\"Mon fourrage\",NOUVEAU!E28,IF($C$9=\"Paille\",Q46,IF($C$9=\"Ensilage\",L46,IF($C$9=\"Pâture\",S46,O46))))","v":" "},null,"Maïs",null,null," ",null," ",null,"Navet",null," "]
[null,null,"Mon fourrage",null,{"$f":"IF($C$9=\"Mon Fourrage\",\"\",IF($C$9=\"Pâture\",\"\",IF($C$9=\"Paille\",\"\",IF($C$11=\"Maïs\",\"\",L55))))","v":" "}]
[null,null,null,null," "]
[]
[null,null,null,"Ventilé (en grange)",null,null,"Ressuyage (25 % MS)",null,null,null,null,"1er cycle début épiaison (25/05)",null,null,null,"Mauvaises conditions < 30 % MS"]
[null,null,{"$f":"IF($C$9=\"Mon Fourrage\",\"\",IF($C$9=\"Pâture\",\"\",IF($C$9=\"Foin\",D50,IF($C$9=\"Paille\",\"\",IF($C$11=\"Maïs\",P50,G50)))))","v":"Ressuyage (25 % MS)"},"Fané au sol par beau temps",null,null,"Préfané (35 % MS)",null,null,null,null,"1er cycle  épaison (10/06)",null,null,null,"Conditions normales 25  % MS"]
[null,null,{"$f":"IF($C$9=\"Mon Fourrage\",\"\",IF($C$9=\"Pâture\",\"\",IF($C$9=\"Foin\",D51,IF($C$9=\"Paille\",\"\",IF($C$11=\"Maïs\",P51,G51)))))","v":"Préfané (35 % MS)"},"Fané au sol < 10 jours)",null,null,"Enrubanné (> 45 % MS)",null,null,null,null,"1er cycle début floraison (20/06)",null,null,null,"Conditions normales 30  % MS"]
[null,null,{"$f":"IF($C$9=\"Mon Fourrage\",\"\",IF($C$9=\"Pâture\",\"\",IF($C$9=\"Foin\",D52,IF($C$9=\"Paille\",\"\",IF($C$11=\"Maïs\",P52,G52)))))","v":"Enrubanné (> 45 % MS)"}," ",null,null," ",null,null,null,null,"2ème cycle (regain)",null,null,null,"Conditions normales 35  % MS"]
[null,null,{"$f":"IF($C$9=\"Mon Fourrage\",\"\",IF($C$9=\"Pâture\",\"\",IF($C$9=\"Foin\",D53,IF($C$9=\"Paille\",\"\",IF($C$11=\"Maïs\",P53,G53)))))","v":" "}," ",null,null," ",null,null,null,null," ",null,null,null,"Très bonnes conditions (> 35 % MS)"]
[null,null,{"$f":"IF($C$9=\"Mon Fourrage\",\"\",IF($C$9=\"Pâture\",\"\",IF($C$9=\"Foin\",D54,IF($C$9=\"Paille\",\"\",IF($C$11=\"Maïs\",P54,G54)))))","v":" "}," ","Fourrage 1",null," ",null,null,null,null," ",null,null,null," "]
[null,null,{"$f":"IF($C$9=\"Pâture\",\"\",IF($C$9=\"Foin\",D55,IF($C$9=\"Paille\",\"\",IF($C$11=\"Maïs\",P55,G55))))","v":" "},null,"Fourrage 2"]
[null,null,null,null,"Fourrage 3",null,null,null,null,{"$f":"IF($C$23=\"mon fourrage\",NOUVEAU!E22,IF($C$23=\"Paille\",Q57,IF($C$23=\"Ensilage\",L57,IF($C$23=\"Pâture\",S57,O57))))","v":"Prairie naturelle"},null,"Prairie naturelle",null,null,"Prairie naturelle",null,"Blé",null,"Pré ",null,"Déprimage"]
[null,null,null,null,null,null,null,null,null,{"$f":"IF($C$23=\"mon fourrage\",NOUVEAU!E23,IF($C$23=\"Paille\",Q58,IF($C$23=\"Ensilage\",L58,IF($C$23=\"Pâture\",S58,O58))))","v":"Fétuque élevée"},null,"Fétuque",null,null,"Fétuque élevée",null,"Orge",null,"Colza fourrager",null,"Printemps"]
[null,null,null,null,{"$f":"IF($C$23=\"Mon Fourrage\",\"\",IF($C$23=\"Pâture\",\"Déprimage\",IF($C$23=\"Paille\",\"\",IF($C$25=\"Maïs\",\"\",L67))))","v":"1er cycle début épiaison (25/05)"},null,null,null,null,{"$f":"IF($C$23=\"mon fourrage\",NOUVEAU!E24,IF($C$23=\"Paille\",Q59,IF($C$23=\"Ensilage\",L59,IF($C$23=\"Pâture\",S59,O59))))","v":"Luzerne-Dactyle"},null,"Luzerne-Dactyle",null,null,"Luzerne-Dactyle",null,"Triticale",null,"Betterave (distribuée)",null,"Fin Printemps"]
[null,null,"Foin",null,{"$f":"IF($C$23=\"Mon Fourrage\",\"\",IF($C$23=\"Pâture\",\"Printemps\",IF($C$23=\"Paille\",\"\",IF($C$25=\"Maïs\",\"\",L68))))","v":"1er cycle  épaison (10/06)"},null,null,null,null,{"$f":"IF($C$23=\"mon fourrage\",NOUVEAU!E25,IF($C$23=\"Paille\",Q60,IF($C$23=\"Ensilage\",L60,IF($C$23=\"Pâture\",S60,O60))))","v":"Trèfle-Ray Grass"},null,"Trèfle-Ray Grass",null,null,"Trèfle-Ray Grass",null,"Avoine",null,"Vesce",null,"Repousses"]
[null,null,"Ensilage",null,{"$f":"IF($C$23=\"Mon Fourrage\",\"\",IF($C$23=\"Pâture\",\"Fin Printemps\",IF($C$23=\"Paille\",\"\",IF($C$25=\"Maïs\",\"\",L69))))","v":"1er cycle début floraison (20/06)"},null,null,null,null,{"$f":"IF($C$23=\"mon fourrage\",NOUVEAU!E26,IF($C$23=\"Paille\",Q61,IF($C$23=\"Ensilage\",L61,IF($C$23=\"Pâture\",S61,O61))))","v":"Ray Grass Italien"},null,"Ray Grass Italien",null,null,"Ray Grass Italien",null,"Paille traitée Ammoniac",null,"Trèfle blanc",null," "]
[null,null,"Paille",null,{"$f":"IF($C$23=\"Mon Fourrage\",\"\",IF($C$23=\"Pâture\",\"Repousse\",IF($C$23=\"Paille\",\"\",IF($C$25=\"Maïs\",\"\",L70))))","v":"2ème cycle (regain)"},null,null,null,null,{"$f":"IF($C$23=\"mon fourrage\",NOUVEAU!E27,IF($C$23=\"Paille\",Q62,IF($C$23=\"Ensilage\",L62,IF($C$23=\"Pâture\",S62,O62))))","v":"Luzerne"},null,"Luzerne",null,null,"Luzerne"," "," ",null,"Avoine",null," "]
[null,null,"Pâture",null,{"$f":"IF($C$23=\"Mon Fourrage\",\"\",IF($C$23=\"Pâture\",\"Dérobé\",IF($C$23=\"Paille\",\"\",IF($C$25=\"Maïs\",\"\",L71))))","v":" "},null,null,null,null,{"$f":"IF($C$23=\"Paille\",Q63,IF($C$23=\"Ensilage\",L63,IF($C$23=\"Pâture\",S63,O63)))","v":" "},null,"Maïs",null,null," ",null," ",null,"Navet",null," "]
[null,null,"Mon fourrage",null,{"$f":"IF($C$23=\"Mon Fourrage\",\"\",IF($C$23=\"Pâture\",\"\",IF($C$23=\"Paille\",\"\",IF($C$25=\"Maïs\",\"\",L72))))","v":" "}]
[null,null,null,null,{"$f":"IF($C$23=\"Pâture\",\"\",IF($C$23=\"Paille\",\"\",IF($C$25=\"Maïs\",\"\",L73)))","v":" "}]
[]
[null,null,null,"Ventilé (en grange)",null,null,"Ressuyage (25 % MS)",null,null,null,null,"1er cycle début épiaison (25/05)",null,null,null,"Mauvaises conditions < 30 % MS"]
[null,null,{"$f":"IF($C$23=\"Mon Fourrage\",\"\",IF($C$23=\"Pâture\",\"\",IF($C$23=\"Foin\",D67,IF($C$23=\"Paille\",\"\",IF($C$25=\"Maïs\",P67,G67)))))","v":"Ressuyage (25 % MS)"},"Fané au sol par beau temps",null,null,"Préfané (35 % MS)",null,null,null,null,"1er cycle  épaison (10/06)",null,null,null,"Conditions normales 25  % MS"]
[null,null,{"$f":"IF($C$23=\"Mon Fourrage\",\"\",IF($C$23=\"Pâture\",\"\",IF($C$23=\"Foin\",D68,IF($C$23=\"Paille\",\"\",IF($C$25=\"Maïs\",P68,G68)))))","v":"Préfané (35 % MS)"},"Fané au sol < 10 jours)",null,null,"Enrubanné (> 45 % MS)",null,null,null,null,"1er cycle début floraison (20/06)",null,null,null,"Conditions normales 30  % MS"]
[null,null,{"$f":"IF($C$23=\"Mon Fourrage\",\"\",IF($C$23=\"Pâture\",\"\",IF($C$23=\"Foin\",D69,IF($C$23=\"Paille\",\"\",IF($C$25=\"Maïs\",P69,G69)))))","v":"Enrubanné (> 45 % MS)"}," ",null,null," ",null,null,null,null,"2ème cycle (regain)",null,null,null,"Conditions normales 35  % MS"]
[null,null,{"$f":"IF($C$23=\"Mon Fourrage\",\"\",IF($C$23=\"Pâture\",\"\",IF($C$23=\"Foin\",D70,IF($C$23=\"Paille\",\"\",IF($C$25=\"Maïs\",P70,G70)))))","v":" "}," ",null,null," ",null,null,null,null," ",null,null,null,"Très bonnes conditions (> 35 % MS)"]
[null,null,{"$f":"IF($C$23=\"Mon Fourrage\",\"\",IF($C$23=\"Pâture\",\"\",IF($C$23=\"Foin\",D71,IF($C$23=\"Paille\",\"\",IF($C$25=\"Maïs\",P71,G71)))))","v":" "}," ",null,null," ",null,null,null,null," ",null,null,null," "]
[null,null,null," ",null,null," ",null,null,null,null," ",null,null,null," "]
[null,null,null,null,null,null,null,null,null,null,null," "]
[]
[]
[null,null,null,"% MS","UEM","UEB","UFL","UFV","PDIN","PDIE","Pabs","Caabs"]
[null,null,"Betterave fourragère",13,0.91,1.2,1.1499999999999999,1.1599999999999999,62,86,1.1000000000000001,0.5]
[null,null,"Ensilage    Fétuque    Enrubanné (> 45 % MS)  1er cycle  épaison (10/06)",55,1.53,1.26,0.67,0.59,66,68,1.4,1.3,27]
[null,null,"Ensilage    Fétuque    Enrubanné (> 45 % MS)  1er cycle début épiaison (25/05)",55,1.41,1.1399999999999999,0.73,0.65,82,75,1.6,1.3,26]
[null,null,"Ensilage    Fétuque    Enrubanné (> 45 % MS)  1er cycle début floraison (20/06)","ND","ND","ND","ND","ND","ND","ND","ND","ND",28]
[null,null,"Ensilage    Fétuque    Enrubanné (> 45 % MS)  2ème cycle (regain)",55,1.4,1.1299999999999999,0.71,0.63,85,77,1.8,1.8,29]
[null,null,"Ensilage    Fétuque    Préfané (35 % MS)  1er cycle  épaison (10/06)",33,1.76,1.23,0.67,0.57999999999999996,69,58,1.4,1.3,23]
[null,null,"Ensilage    Fétuque    Préfané (35 % MS)  1er cycle début épiaison (25/05)",33,1.48,1.1299999999999999,0.73,0.65,83,63,1.6,1.3,22]
[null,null,"Ensilage    Fétuque    Préfané (35 % MS)  1er cycle début floraison (20/06)","ND","ND","ND","ND","ND","ND","ND","ND","ND",24]
[null,null,"Ensilage    Fétuque    Préfané (35 % MS)  2ème cycle (regain)",33,1.46,1.1200000000000001,0.72,0.64,85,64,1.8,1.8,25]
[null,null,"Ensilage    Fétuque    Ressuyage (25 % MS)  1er cycle  épaison (10/06)",21,1.48,1.4,0.73,0.64,65,49,1.4,1.3,19]
[null,null,"Ensilage    Fétuque    Ressuyage (25 % MS)  1er cycle début épiaison (25/05)",21,1.39,1.31,0.79,0.72,78,53,1.6,1.3,18]
[null,null,"Ensilage    Fétuque    Ressuyage (25 % MS)  1er cycle début floraison (20/06)","ND","ND","ND","ND","ND","ND","ND","ND","ND",20]
[null,null,"Ensilage    Fétuque    Ressuyage (25 % MS)  2ème cycle (regain)",21,1.38,1.26,0.78,0.7,81,55,1.8,1.8,21]
[null,null,"Ensilage    Luzerne    Enrubanné (> 45 % MS)  1er cycle  épaison (10/06)",55,1.2,1.07,0.67,0.56999999999999995,105,75,1.7,3.8,75]
[null,null,"Ensilage    Luzerne    Enrubanné (> 45 % MS)  1er cycle début épiaison (25/05)",55,1.19,1.07,0.71,0.62,113,79,1.7,3.8,74]
[null,null,"Ensilage    Luzerne    Enrubanné (> 45 % MS)  1er cycle début floraison (20/06)","ND","ND","ND","ND","ND","ND","ND","ND","ND",76]
[null,null,"Ensilage    Luzerne    Enrubanné (> 45 % MS)  2ème cycle (regain)",55,1.17,1.08,0.7,0.61,114,77,1.5,3.6,77]
[null,null,"Ensilage    Luzerne    Préfané (35 % MS)  1er cycle  épaison (10/06)","ND","ND","ND","ND","ND","ND","ND","ND","ND",71]
[null,null,"Ensilage    Luzerne    Préfané (35 % MS)  1er cycle début épiaison (25/05)","ND","ND","ND","ND","ND","ND","ND","ND","ND",70]
[null,null,"Ensilage    Luzerne    Préfané (35 % MS)  1er cycle début floraison (20/06)","ND","ND","ND","ND","ND","ND","ND","ND","ND",72]
[null,null,"Ensilage    Luzerne    Préfané (35 % MS)  2ème cycle (regain)","ND","ND","ND","ND","ND","ND","ND","ND","ND",73]
[null,null,"Ensilage    Luzerne    Ressuyage (25 % MS)  1er cycle  épaison (10/06)","ND","ND","ND","ND","ND","ND","ND","ND","ND",67]
[null,null,"Ensilage    Luzerne    Ressuyage (25 % MS)  1er cycle début épiaison (25/05)","ND","ND","ND","ND","ND","ND","ND","ND","ND",66]
[null,null,"Ensilage    Luzerne    Ressuyage (25 % MS)  1er cycle début floraison (20/06)","ND","ND","ND","ND","ND","ND","ND","ND","ND",68]
[null,null,"Ensilage    Luzerne    Ressuyage (25 % MS)  2ème cycle (regain)","ND","ND","ND","ND","ND","ND","ND","ND","ND",69]
[null,null,"Ensilage    Luzerne-Dactyle    Enrubanné (> 45 % MS)  1er cycle  épaison (10/06)",55,1.37,1.1599999999999999,0.69,0.6,91,74,1.5,2.4,39]
[null,null,"Ensilage    Luzerne-Dactyle    Enrubanné (> 45 % MS)  1er cycle début épiaison (25/05)",55,1.26,1.07,0.76,0.68,107,82,1.5,2.4,38]
[null,null,"Ensilage    Luzerne-Dactyle    Enrubanné (> 45 % MS)  1er cycle début floraison (20/06)","ND","ND","ND","ND","ND","ND","ND","ND","ND",40]
[null,null,"Ensilage    Luzerne-Dactyle    Enrubanné (> 45 % MS)  2ème cycle (regain)",55,1.27,1.0900000000000001,0.71,0.62,103,78,1.5,2.8,41]
[null,null,"Ensilage    Luzerne-Dactyle    Préfané (35 % MS)  1er cycle  épaison (10/06)",33,1.1599999999999999,1.1200000000000001,0.73,0.64,98,65,1.5,2.4,35]
[null,null,"Ensilage    Luzerne-Dactyle    Préfané (35 % MS)  1er cycle début épiaison (25/05)",33,1.21,1.01,0.8,0.73,113,71,1.5,2.4,34]
[null,null,"Ensilage    Luzerne-Dactyle    Préfané (35 % MS)  1er cycle début floraison (20/06)","ND","ND","ND","ND","ND","ND","ND","ND","ND",32]
[null,null,"Ensilage    Luzerne-Dactyle    Préfané (35 % MS)  2ème cycle (regain)",33,1.23,1.04,0.73,0.64,106,66,1.5,2.8,37]
[null,null,"Ensilage    Luzerne-Dactyle    Ressuyage (25 % MS)  1er cycle  épaison (10/06)",21,1.32,1.32,0.79,0.71,90,55,1.5,2.4,31]
[null,null,"Ensilage    Luzerne-Dactyle    Ressuyage (25 % MS)  1er cycle début épiaison (25/05)",21,1.22,1.22,0.87,0.8,102,60,1.5,2.4,30]
[null,null,"Ensilage    Luzerne-Dactyle    Ressuyage (25 % MS)  1er cycle début floraison (20/06)","ND","ND","ND","ND","ND","ND","ND","ND","ND",36]
[null,null,"Ensilage    Luzerne-Dactyle    Ressuyage (25 % MS)  2ème cycle (regain)",21,1.23,1.17,0.78,0.69,98,56,1.5,2.8,33]
[null,null,"Ensilage    Maïs    Conditions normales 25  % MS  ",25,1.28,1.23,0.9,0.8,44,63,1.3,0.8,1]
[null,null,"Ensilage    Maïs    Conditions normales 30  % MS  ",30,1.28,1.1299999999999999,0.9,0.8,42,65,1.3,0.8,2]
[null,null,"Ensilage    Maïs    Conditions normales 35  % MS  ",35,1.28,1.05,0.91,0.81,42,67,1.3,0.8,3]
[null,null,"Ensilage    Maïs    Mauvaises conditions < 30 % MS  ",25,1.5,1.26,0.85,0.73,65,66,1.3,0.8,5]
[null,null,"Ensilage    Maïs    Très bonnes conditions (> 35 % MS)  ",35,1.36,1,0.96,0.87,50,71,1.3,0.8,4]
[null,null,"Ensilage    Prairie naturelle    Enrubanné (> 45 % MS)  1er cycle  épaison",55,1.56,1.29,0.73,0.65,71,75,1.9,2,15]
[null,null,"Ensilage    Prairie naturelle    Enrubanné (> 45 % MS)  1er cycle début épiaison",55,1.38,1.1100000000000001,0.82,0.75,86,83,1.9,2.2000000000000002,14]
[null,null,"Ensilage    Prairie naturelle    Enrubanné (> 45 % MS)  1er cycle début floraison","ND","ND","ND","ND","ND","ND","ND","ND","ND",16]
[null,null,"Ensilage    Prairie naturelle    Enrubanné (> 45 % MS)  2ème cycle (regain)",55,1.51,1.24,0.76,0.68,71,77,1.9,2.2000000000000002,17]
[null,null,"Ensilage    Prairie naturelle    Préfané (35 % MS)  1er cycle  épaison",33,1.85,1.26,0.75,0.66,74,65,1.9,2,11]
[null,null,"Ensilage    Prairie naturelle    Préfané (35 % MS)  1er cycle début épiaison ",33,1.4,1.0900000000000001,0.85,0.77,87,72,1.9,2.2000000000000002,10]
[null,null,"Ensilage    Prairie naturelle    Préfané (35 % MS)  1er cycle début floraison","ND","ND","ND","ND","ND","ND","ND","ND","ND",12]
[null,null,"Ensilage    Prairie naturelle    Préfané (35 % MS)  2ème cycle (regain)",33,1.71,1.21,0.79,0.7,74,68,1.9,2.2000000000000002,13]
[null,null,"Ensilage    Prairie naturelle    Ressuyage (25 % MS)  1er cycle  épaison ",21,1.51,1.45,0.81,0.72,70,58,1.9,2,7]
[null,null,"Ensilage    Prairie naturelle    Ressuyage (25 % MS)  1er cycle début épiaison ",20,1.36,1.31,0.9,0.83,80,62,1.9,2.2000000000000002,6]
[null,null,"Ensilage    Prairie naturelle    Ressuyage (25 % MS)  1er cycle début floraison","ND","ND","ND","ND","ND","ND","ND","ND","ND",8]
[null,null,"Ensilage    Prairie naturelle    Ressuyage (25 % MS)  2ème cycle (regain)",21,1.47,1.41,0.84,0.77,69,60,1.9,2.2000000000000002,9]
[null,null,"Ensilage    Ray Grass Italien    Enrubanné (> 45 % MS)  1er cycle  épaison (10/06)",55,1.48,1.21,0.72,0.64,52,67,1.4,1.8,63]
[null,null,"Ensilage    Ray Grass Italien    Enrubanné (> 45 % MS)  1er cycle début épiaison (25/05)",55,1.37,1.1000000000000001,0.81,0.74,67,76,1.6,1.8,62]
[null,null,"Ensilage    Ray Grass Italien    Enrubanné (> 45 % MS)  1er cycle début floraison (20/06)","ND","ND","ND","ND","ND","ND","ND","ND","ND",64]
[null,null,"Ensilage    Ray Grass Italien    Enrubanné (> 45 % MS)  2ème cycle (regain)",55,1.42,1.1499999999999999,0.71,0.63,78,75,1.6,1.8,65]
[null,null,"Ensilage    Ray Grass Italien    Préfané (35 % MS)  1er cycle  épaison (10/06)",33,1.62,1.18,0.74,0.67,57,59,1.4,1.8,59]
[null,null,"Ensilage    Ray Grass Italien    Préfané (35 % MS)  1er cycle début épiaison (25/05)",33,1.39,1.08,0.83,0.77,70,65,1.6,1.8,58]
[null,null,"Ensilage    Ray Grass Italien    Préfané (35 % MS)  1er cycle début floraison (20/06)","ND","ND","ND","ND","ND","ND","ND","ND","ND",60]
[null,null,"Ensilage    Ray Grass Italien    Préfané (35 % MS)  2ème cycle (regain)",33,1.49,1.1299999999999999,0.72,0.64,80,64,1.6,1.8,61]
[null,null,"Ensilage    Ray Grass Italien    Ressuyage (25 % MS)  1er cycle  épaison (10/06)",21,1.44,1.35,0.81,0.73,54,51,1.4,1.8,55]
[null,null,"Ensilage    Ray Grass Italien    Ressuyage (25 % MS)  1er cycle début épiaison (25/05)",21,1.36,1.3,0.9,0.84,65,55,1.6,1.8,54]
[null,null,"Ensilage    Ray Grass Italien    Ressuyage (25 % MS)  1er cycle début floraison (20/06)","ND","ND","ND","ND","ND","ND","ND","ND","ND",56]
[null,null,"Ensilage    Ray Grass Italien    Ressuyage (25 % MS)  2ème cycle (regain)",21,1.39,1.31,0.79,0.71,74,53,1.6,1.8,57]
[null,null,"Ensilage    Trèfle-Ray Grass    Enrubanné (> 45 % MS)  1er cycle  épaison (10/06)",55,1.33,1.19,0.76,0.69,86,77,1.7,2.8,51]
[null,null,"Ensilage    Trèfle-Ray Grass    Enrubanné (> 45 % MS)  1er cycle début épiaison (25/05)",55,1.26,1.08,0.83,0.76,103,84,1.7,2.8,50]
[null,null,"Ensilage    Trèfle-Ray Grass    Enrubanné (> 45 % MS)  1er cycle début floraison (20/06)","ND","ND","ND","ND","ND","ND","ND","ND","ND",52]
[null,null,"Ensilage    Trèfle-Ray Grass    Enrubanné (> 45 % MS)  2ème cycle (regain)",55,1.24,1.0900000000000001,0.74,0.66,95,78,1.7,2.8,53]
[null,null,"Ensilage    Trèfle-Ray Grass    Préfané (35 % MS)  1er cycle  épaison (10/06)",33,1.45,1.17,0.77,0.7,87,72,1.7,2.8,47]
[null,null,"Ensilage    Trèfle-Ray Grass    Préfané (35 % MS)  1er cycle début épiaison (25/05)",33,1.3,1.08,0.84,0.78,103,78,1.7,2.8,46]
[null,null,"Ensilage    Trèfle-Ray Grass    Préfané (35 % MS)  1er cycle début floraison (20/06)","ND","ND","ND","ND","ND","ND","ND","ND","ND",48]
[null,null,"Ensilage    Trèfle-Ray Grass    Préfané (35 % MS)  2ème cycle (regain)",33,1.46,1.1399999999999999,0.76,0.69,80,72,1.7,2.8,49]
[null,null,"Ensilage    Trèfle-Ray Grass    Ressuyage (25 % MS)  1er cycle  épaison (10/06)",21,1.29,1.33,0.86,0.79,82,56,1,2.8,43]
[null,null,"Ensilage    Trèfle-Ray Grass    Ressuyage (25 % MS)  1er cycle début épiaison (25/05)",21,1.24,1.28,0.93,0.88,93,60,1.7,2.8,42]
[null,null,"Ensilage    Trèfle-Ray Grass    Ressuyage (25 % MS)  1er cycle début floraison (20/06)","ND","ND","ND","ND","ND","ND","ND","ND","ND",44]
[null,null,"Ensilage    Trèfle-Ray Grass    Ressuyage (25 % MS)  2ème cycle (regain)",21,1.21,1.1599999999999999,0.82,0.74,91,86,1.7,2.8,45]
[null,null,"Fané < 10 jours 3è coupe",85,1.28,1.1599999999999999,0.6,0.5,119,86,1.3,4.3,149]
[null,null,"Fané par beau temps 3è coupe",85,1.18,1.06,0.68,0.57999999999999996,122,92,1.3,4.3,145]
[null,null,"Foin    Fétuque élevée    Fané au sol < 10 jours)  1er cycle  épaison (10/06)",85,1.52,1.2,0.64,0.55000000000000004,65,74,1.6,1.1000000000000001,99]
[null,null,"Foin    Fétuque élevée    Fané au sol < 10 jours)  1er cycle début épiaison (25/05)",85,"ND","ND","ND","ND","ND","ND","ND","ND",98]
[null,null,"Foin    Fétuque élevée    Fané au sol < 10 jours)  1er cycle début floraison (20/06)",85,1.82,1.36,0.55000000000000004,0.45,56,65,1.4,1.1000000000000001,100]
[null,null,"Foin    Fétuque élevée    Fané au sol < 10 jours)  2ème cycle (regain)",85,1.45,1.1499999999999999,0.67,0.57999999999999996,80,82,1.9,1.4,101]
[null,null,"Foin    Fétuque élevée    Fané au sol par beau temps  1er cycle  épaison (10/06)",85,1.4,1.1100000000000001,0.66,0.57999999999999996,69,76,1.6,1.1000000000000001,95]
[null,null,"Foin    Fétuque élevée    Fané au sol par beau temps  1er cycle début épiaison (25/05)",85,"ND","ND","ND","ND","ND","ND","ND","ND",94]
[null,null,"Foin    Fétuque élevée    Fané au sol par beau temps  1er cycle début floraison (20/06)",85,1.64,1.27,0.56999999999999995,0.47,59,68,1.4,1.1000000000000001,96]
[null,null,"Foin    Fétuque élevée    Fané au sol par beau temps  2ème cycle (regain)",85,1.33,1.06,0.69,0.61,84,85,1.9,1.4,97]
[null,null,"Foin    Fétuque élevée    Ventilé (en grange)  1er cycle  épaison (10/06)",85,1.3,1.1100000000000001,0.67,0.57999999999999996,69,77,1.6,1.1000000000000001,91]
[null,null,"Foin    Fétuque élevée    Ventilé (en grange)  1er cycle début épiaison (25/05)",85,1.22,1.04,0.73,0.65,89,87,1.7,1.1000000000000001,90]
[null,null,"Foin    Fétuque élevée    Ventilé (en grange)  1er cycle début floraison (20/06)","ND","ND","ND","ND","ND","ND","ND","ND","ND",92]
[null,null,"Foin    Fétuque élevée    Ventilé (en grange)  2ème cycle (regain)","ND","ND","ND","ND","ND","ND","ND","ND","ND",93]
[null,null,"Foin    Luzerne    Fané au sol < 10 jours)  1er cycle  épaison (10/06)",85,1.34,1.1499999999999999,0.55000000000000004,0.44,103,81,1.3,3.8,147]
[null,null,"Foin    Luzerne    Fané au sol < 10 jours)  1er cycle début épiaison (25/05)",85,1.3,1.1399999999999999,0.6,0.49,111,86,1.4,3.8,146]
[null,null,"Foin    Luzerne    Fané au sol < 10 jours)  1er cycle début floraison (20/06)","ND","ND","ND","ND","ND","ND","ND","ND","ND",149]
[null,null,"Foin    Luzerne    Fané au sol < 10 jours)  2ème cycle (regain)",85,1.27,1.1399999999999999,0.59,0.49,111,74,1.3,3.3,148]
[null,null,"Foin    Luzerne    Fané au sol par beau temps  1er cycle  épaison (10/06)",85,1.23,1.05,0.62,0.52,107,87,1.3,3.8,143]
[null,null,"Foin    Luzerne    Fané au sol par beau temps  1er cycle début épiaison (25/05)",85,1.2,1.04,0.67,0.57999999999999996,114,91,1.4,3.8,142]
[null,null,"Foin    Luzerne    Fané au sol par beau temps  1er cycle début floraison (20/06)","ND","ND","ND","ND","ND","ND","ND","ND","ND",145]
[null,null,"Foin    Luzerne    Fané au sol par beau temps  2ème cycle (regain)",85,1.17,1.04,0.67,0.56999999999999995,115,90,1.3,3.3,144]
[null,null,"Foin    Luzerne    Ventilé (en grange)  1er cycle  épaison (10/06)",85,1.1399999999999999,0.95,0.66,0.56000000000000005,113,91,1.4,3.8,139]
[null,null,"Foin    Luzerne    Ventilé (en grange)  1er cycle début épiaison (25/05)",85,1.1000000000000001,0.92,0.71,0.63,122,96,1.4,3.8,138]
[null,null,"Foin    Luzerne    Ventilé (en grange)  1er cycle début floraison (20/06)","ND","ND","ND","ND","ND","ND","ND","ND","ND",140]
[null,null,"Foin    Luzerne    Ventilé (en grange)  2ème cycle (regain)","ND","ND","ND","ND","ND","ND","ND","ND","ND",141]
[null,null,"Foin    Luzerne-Dactyle    Fané au sol < 10 jours)  1er cycle  épaison (10/06)",85,1.4,1.1599999999999999,0.66,0.56000000000000005,99,86,1.4,2.2999999999999998,111]
[null,null,"Foin    Luzerne-Dactyle    Fané au sol < 10 jours)  1er cycle début épiaison (25/05)","ND","ND","ND","ND","ND","ND","ND","ND","ND",110]
[null,null,"Foin    Luzerne-Dactyle    Fané au sol < 10 jours)  1er cycle début floraison (20/06)",85,1.6,1.27,0.56999999999999995,0.46,80,74,1.2,2.2999999999999998,112]
[null,null,"Foin    Luzerne-Dactyle    Fané au sol < 10 jours)  2ème cycle (regain)",85,1.33,1.1299999999999999,0.63,0.54,99,79,1.4,2.4,113]
[null,null,"Foin    Luzerne-Dactyle    Fané au sol par beau temps  1er cycle  épaison (10/06)",85,1.28,1.06,0.71,0.63,102,90,1.4,2.2999999999999998,107]
[null,null,"Foin    Luzerne-Dactyle    Fané au sol par beau temps  1er cycle début épiaison (25/05)","ND","ND","ND","ND","ND","ND","ND","ND","ND",106]
[null,null,"Foin    Luzerne-Dactyle    Fané au sol par beau temps  1er cycle début floraison (20/06)",85,1.45,1.17,0.61,0.51,83,79,1.2,2.2999999999999998,108]
[null,null,"Foin    Luzerne-Dactyle    Fané au sol par beau temps  2ème cycle (regain)",85,1.22,1.03,0.68,0.59,103,89,1.4,2.4,109]
[null,null,"Foin    Luzerne-Dactyle    Ventilé (en grange)  1er cycle  épaison (10/06)",85,1.21,1.01,0.71,0.62,102,90,1.4,2.2999999999999998,103]
[null,null,"Foin    Luzerne-Dactyle    Ventilé (en grange)  1er cycle début épiaison (25/05)",85,1.1000000000000001,0.93,0.76,0.69,123,99,1.5,2.4,102]
[null,null,"Foin    Luzerne-Dactyle    Ventilé (en grange)  1er cycle début floraison (20/06)","ND","ND","ND","ND","ND","ND","ND","ND","ND",104]
[null,null,"Foin    Luzerne-Dactyle    Ventilé (en grange)  2ème cycle (regain)","ND","ND","ND","ND","ND","ND","ND","ND","ND",105]
[null,null,"Foin    Prairie naturelle    Fané au sol < 10 jours)  1er cycle  épaison ",85,1.69,1.29,0.69,0.6,65,79,2,1.5,87]
[null,null,"Foin    Prairie naturelle    Fané au sol < 10 jours)  1er cycle début épiaison",85,1.4,1.1299999999999999,0.76,0.67,82,88,2.1,1.6,86]
[null,null,"Foin    Prairie naturelle    Fané au sol < 10 jours)  1er cycle début floraison ",85,1.88,1.4,0.61,0.51,54,71,2,1.4,88]
[null,null,"Foin    Prairie naturelle    Fané au sol < 10 jours)  2ème cycle (regain)",85,1.4,1.1200000000000001,0.75,0.66,96,96,2.1,2,89]
[null,null,"Foin    Prairie naturelle    Fané au sol par beau temps  1er cycle  épaison",85,1.53,1.2,0.72,0.63,69,82,2,1.5,83]
[null,null,"Foin    Prairie naturelle    Fané au sol par beau temps  1er cycle début épiaison",85,1.3,1.04,0.8,0.72,85,91,2.1,1.6,82]
[null,null,"Foin    Prairie naturelle    Fané au sol par beau temps  1er cycle début floraison",85,1.69,1.31,0.63,0.53,58,73,2,1.4,84]
[null,null,"Foin    Prairie naturelle    Fané au sol par beau temps  2ème cycle (regain)",85,1.29,1.03,0.79,0.71,100,99,2.1,2,85]
[null,null,"Foin    Prairie naturelle    Ventilé (en grange)  1er cycle  épaison",85,1.42,1.2,0.71,0.63,69,82,2,1.5,79]
[null,null,"Foin    Prairie naturelle    Ventilé (en grange)  1er cycle début épiaison",85,1.21,1.04,0.8,0.72,85,91,2.1,1.6,78]
[null,null,"Foin    Prairie naturelle    Ventilé (en grange)  1er cycle début floraison","ND","ND","ND","ND","ND","ND","ND","ND","ND",80]
[null,null,"Foin    Prairie naturelle    Ventilé (en grange)  2ème cycle (regain)","ND","ND","ND","ND","ND","ND","ND","ND","ND",81]
[null,null,"Foin    Ray Grass Italien    Fané au sol < 10 jours)  1er cycle  épaison (10/06)",85,1.49,1.17,0.71,0.62,50,72,1.4,1.4,135]
[null,null,"Foin    Ray Grass Italien    Fané au sol < 10 jours)  1er cycle début épiaison (25/05)","ND","ND","ND","ND","ND","ND","ND","ND","ND",134]
[null,null,"Foin    Ray Grass Italien    Fané au sol < 10 jours)  1er cycle début floraison (20/06)",85,1.79,1.35,0.6,0.5,32,59,1.2,1.4,136]
[null,null,"Foin    Ray Grass Italien    Fané au sol < 10 jours)  2ème cycle (regain)",85,1.46,1.1599999999999999,0.67,0.57999999999999996,73,80,1.6,1.4,137]
[null,null,"Foin    Ray Grass Italien    Fané au sol par beau temps  1er cycle  épaison (10/06)",85,1.36,1.08,0.74,0.66,54,75,1.4,1.4,131]
[null,null,"Foin    Ray Grass Italien    Fané au sol par beau temps  1er cycle début épiaison (25/05)","ND","ND","ND","ND","ND","ND","ND","ND","ND",130]
[null,null,"Foin    Ray Grass Italien    Fané au sol par beau temps  1er cycle début floraison (20/06)",85,1.62,1.26,0.61,0.52,36,61,1.2,1.4,132]
[null,null,"Foin    Ray Grass Italien    Fané au sol par beau temps  2ème cycle (regain)",85,1.35,1.07,0.7,0.61,76,82,1.6,1.4,133]
[null,null,"Foin    Ray Grass Italien    Ventilé (en grange)  1er cycle  épaison (10/06)",85,1.27,1.08,0.74,0.66,54,75,1.4,1.4,127]
[null,null,"Foin    Ray Grass Italien    Ventilé (en grange)  1er cycle début épiaison (25/05)",85,1.19,1.01,0.81,0.75,70,85,1.6,1.4,126]
[null,null,"Foin    Ray Grass Italien    Ventilé (en grange)  1er cycle début floraison (20/06)","ND","ND","ND","ND","ND","ND","ND","ND","ND",128]
[null,null,"Foin    Ray Grass Italien    Ventilé (en grange)  2ème cycle (regain)","ND","ND","ND","ND","ND","ND","ND","ND","ND",129]
[null,null,"Foin    Trèfle-Ray Grass    Fané au sol < 10 jours)  1er cycle  épaison (10/06)",85,1.31,1.1599999999999999,0.73,0.59,93,84,1.5,2.2999999999999998,123]
[null,null,"Foin    Trèfle-Ray Grass    Fané au sol < 10 jours)  1er cycle début épiaison (25/05)","ND","ND","ND","ND","ND","ND","ND","ND","ND",122]
[null,null,"Foin    Trèfle-Ray Grass    Fané au sol < 10 jours)  1er cycle début floraison (20/06)",85,1.54,1.29,0.61,0.51,70,72,1.3,2.2000000000000002,124]
[null,null,"Foin    Trèfle-Ray Grass    Fané au sol < 10 jours)  2ème cycle (regain)",85,1.25,1.1100000000000001,0.65,0.56000000000000005,92,83,1.5,2.4,125]
[null,null,"Foin    Trèfle-Ray Grass    Fané au sol par beau temps  1er cycle  épaison (10/06)",85,1.2,1.07,0.74,0.66,92,88,1.5,2.2999999999999998,119]
[null,null,"Foin    Trèfle-Ray Grass    Fané au sol par beau temps  1er cycle début épiaison (25/05)","ND","ND","ND","ND","ND","ND","ND","ND","ND",118]
[null,null,"Foin    Trèfle-Ray Grass    Fané au sol par beau temps  1er cycle début floraison (20/06)",85,1.4,1.2,0.63,0.54,75,76,1.2,2.2000000000000002,120]
[null,null,"Foin    Trèfle-Ray Grass    Fané au sol par beau temps  2ème cycle (regain)",85,1.1399999999999999,1.01,0.69,0.61,97,87,1.5,2.4,121]
[null,null,"Foin    Trèfle-Ray Grass    Ventilé (en grange)  1er cycle  épaison (10/06)",85,1.21,1.07,0.75,0.67,86,87,1.4,2.2999999999999998,115]
[null,null,"Foin    Trèfle-Ray Grass    Ventilé (en grange)  1er cycle début épiaison (25/05)",85,1.07,0.96,0.81,0.75,108,97,1.6,2.4,114]
[null,null,"Foin    Trèfle-Ray Grass    Ventilé (en grange)  1er cycle début floraison (20/06)","ND","ND","ND","ND","ND","ND","ND","ND","ND",116]
[null,null,"Foin    Trèfle-Ray Grass    Ventilé (en grange)  2ème cycle (regain)","ND","ND","ND","ND","ND","ND","ND","ND","ND",117]
[null,null,"Mon fourrage    N°1",{"$f":"#REF!","v":{"$error":"#REF!"}},{"$f":"#REF!","v":{"$error":"#REF!"}},null,{"$f":"#REF!","v":{"$error":"#REF!"}},null,{"$f":"#REF!","v":{"$error":"#REF!"}},{"$f":"#REF!","v":{"$error":"#REF!"}},{"$f":"#REF!","v":{"$error":"#REF!"}},{"$f":"#REF!","v":{"$error":"#REF!"}},150]
[null,null,"Mon fourrage    N°2",{"$f":"#REF!","v":{"$error":"#REF!"}},{"$f":"#REF!","v":{"$error":"#REF!"}},null,{"$f":"#REF!","v":{"$error":"#REF!"}},null,{"$f":"#REF!","v":{"$error":"#REF!"}},{"$f":"#REF!","v":{"$error":"#REF!"}},{"$f":"#REF!","v":{"$error":"#REF!"}},{"$f":"#REF!","v":{"$error":"#REF!"}},151]
[null,null,"Mon fourrage    N°3",{"$f":"#REF!","v":{"$error":"#REF!"}},{"$f":"#REF!","v":{"$error":"#REF!"}},null,{"$f":"#REF!","v":{"$error":"#REF!"}},null,{"$f":"#REF!","v":{"$error":"#REF!"}},{"$f":"#REF!","v":{"$error":"#REF!"}},{"$f":"#REF!","v":{"$error":"#REF!"}},{"$f":"#REF!","v":{"$error":"#REF!"}},152]
[null,null,"Paille    Avoine      ",88,2.2999999999999998,1.7,0.5,0.39,20,48,0.5,1.4,154]
[null,null,"Paille    Blé      ",88,2.41,1.8,0.42,0.31,22,44,0.5,0.8,153]
[null,null,"Paille    Orge      ",88,2.4700000000000002,1.8,0.44,0.33,24,46,0.5,1.4,163]
[null,null,"Paille    Paille traitée Ammoniac      ",88,1.74,1.3,0.57999999999999996,0.48,43,54,0.5,1.4,160]
[null,null,"Paille    Triticale      ",88,2.41,1.8,0.42,0.31,22,44,0.5,0.8,159]
[null,null,"Pâture    Avoine      ",15,0.94,0.95,1,0.98,75,87,2.2000000000000002,1.9,164]
[null,null,"Pâture    Betterave (distribuée)      ",13,0.91,1.2,1.1499999999999999,1.1599999999999999,62,86,1.1000000000000001,0.5,155]
[null,null,"Pâture    Colza fourrager      ",13,0.91,0.93,0.91,0.89,124,97,2.2999999999999998,4.7,157]
[null,null,"Pâture    Navet      ",10,0.9,0.7,1.1200000000000001,1.1200000000000001,68,84,1.8,1.1000000000000001,156]
[null,null,"Pâture    Pré       Déprimage",16,0.9,0.9,1,0.95,140,105,2.9,2.2999999999999998,158]
[null,null,"Pâture    Pré       Fin Printemps",20,1.25,1.2,0.8,0.7,75,85,2.5,2,162]
[null,null,"Pâture    Pré       Printemps",17,0.95,0.95,0.95,0.9,110,100,2.8,2.1,161]
[null,null,"Pâture    Pré       Repousse",19,1.05,1.05,0.85,0.8,100,90,2.5,2]
[null,null,"Pâture    Trèfle blanc      ",10,0.83,0.87,1.0900000000000001,1.06,161,106,1.9,3.9]
[null,null,"Pâture    Vesce      ",19,0.88,0.91,0.89,0.84,154,99,2.2999999999999998,3.7]
[]
[]
[]
[]
[null,null,null,"MS","UEM","UEB","UFL","UFV","PDIN","PDIE","P","Ca"]
[]
[]
[]
[]
[]
[]
[null,null,null,"% MS","UEM","UEB","UFL","UFV","PDIN","PDIE","Pabs","Caabs"]
[null,null,"Betterave fourragère",13,0.91,1.2,1.1499999999999999,1.1599999999999999,62,86,1.1000000000000001,0.5]
[null,null,"Ensilage    Fétuque    Enrubanné (> 45 % MS)  1er cycle  épaison (10/06)",55,1.53,1.26,0.67,0.59,66,68,1.4,1.3,27]
[null,null,"Ensilage    Fétuque    Enrubanné (> 45 % MS)  1er cycle début épiaison (25/05)",55,1.41,1.1399999999999999,0.73,0.65,82,75,1.6,1.3,26]
[null,null,"Ensilage    Fétuque    Enrubanné (> 45 % MS)  1er cycle début floraison (20/06)","ND","ND","ND","ND","ND","ND","ND","ND","ND",28]
[null,null,"Ensilage    Fétuque    Enrubanné (> 45 % MS)  2ème cycle (regain)",55,1.4,1.1299999999999999,0.71,0.63,85,77,1.8,1.8,29]
[null,null,"Ensilage    Fétuque    Préfané (35 % MS)  1er cycle  épaison (10/06)",33,1.76,1.23,0.67,0.57999999999999996,69,58,1.4,1.3,23]
[null,null,"Ensilage    Fétuque    Préfané (35 % MS)  1er cycle début épiaison (25/05)",33,1.48,1.1299999999999999,0.73,0.65,83,63,1.6,1.3,22]
[null,null,"Ensilage    Fétuque    Préfané (35 % MS)  1er cycle début floraison (20/06)","ND","ND","ND","ND","ND","ND","ND","ND","ND",24]
[null,null,"Ensilage    Fétuque    Préfané (35 % MS)  2ème cycle (regain)",33,1.46,1.1200000000000001,0.72,0.64,85,64,1.8,1.8,25]
[null,null,"Ensilage    Fétuque    Ressuyage (25 % MS)  1er cycle  épaison (10/06)",21,1.48,1.4,0.73,0.64,65,49,1.4,1.3,19]
[null,null,"Ensilage    Fétuque    Ressuyage (25 % MS)  1er cycle début épiaison (25/05)",21,1.39,1.31,0.79,0.72,78,53,1.6,1.3,18]
[null,null,"Ensilage    Fétuque    Ressuyage (25 % MS)  1er cycle début floraison (20/06)","ND","ND","ND","ND","ND","ND","ND","ND","ND",20]
[null,null,"Ensilage    Fétuque    Ressuyage (25 % MS)  2ème cycle (regain)",21,1.38,1.26,0.78,0.7,81,55,1.8,1.8,21]
[null,null,"Ensilage    Luzerne    Enrubanné (> 45 % MS)  1er cycle  épaison (10/06)",55,1.2,1.07,0.67,0.56999999999999995,105,75,1.7,3.8,75]
[null,null,"Ensilage    Luzerne    Enrubanné (> 45 % MS)  1er cycle début épiaison (25/05)",55,1.19,1.07,0.71,0.62,113,79,1.7,3.8,74]
[null,null,"Ensilage    Luzerne    Enrubanné (> 45 % MS)  1er cycle début floraison (20/06)","ND","ND","ND","ND","ND","ND","ND","ND","ND",76]
[null,null,"Ensilage    Luzerne    Enrubanné (> 45 % MS)  2ème cycle (regain)",55,1.17,1.08,0.7,0.61,114,77,1.5,3.6,77]
[null,null,"Ensilage    Luzerne    Préfané (35 % MS)  1er cycle  épaison (10/06)","ND","ND","ND","ND","ND","ND","ND","ND","ND",71]
[null,null,"Ensilage    Luzerne    Préfané (35 % MS)  1er cycle début épiaison (25/05)","ND","ND","ND","ND","ND","ND","ND","ND","ND",70]
[null,null,"Ensilage    Luzerne    Préfané (35 % MS)  1er cycle début floraison (20/06)","ND","ND","ND","ND","ND","ND","ND","ND","ND",72]
[null,null,"Ensilage    Luzerne    Préfané (35 % MS)  2ème cycle (regain)","ND","ND","ND","ND","ND","ND","ND","ND","ND",73]
[null,null,"Ensilage    Luzerne    Ressuyage (25 % MS)  1er cycle  épaison (10/06)","ND","ND","ND","ND","ND","ND","ND","ND","ND",67]
[null,null,"Ensilage    Luzerne    Ressuyage (25 % MS)  1er cycle début épiaison (25/05)","ND","ND","ND","ND","ND","ND","ND","ND","ND",66]
[null,null,"Ensilage    Luzerne    Ressuyage (25 % MS)  1er cycle début floraison (20/06)","ND","ND","ND","ND","ND","ND","ND","ND","ND",68]
[null,null,"Ensilage    Luzerne    Ressuyage (25 % MS)  2ème cycle (regain)","ND","ND","ND","ND","ND","ND","ND","ND","ND",69]
[null,null,"Ensilage    Luzerne-Dactyle    Enrubanné (> 45 % MS)  1er cycle  épaison (10/06)",55,1.37,1.1599999999999999,0.69,0.6,91,74,1.5,2.4,39]
[null,null,"Ensilage    Luzerne-Dactyle    Enrubanné (> 45 % MS)  1er cycle début épiaison (25/05)",55,1.26,1.07,0.76,0.68,107,82,1.5,2.4,38]
[null,null,"Ensilage    Luzerne-Dactyle    Enrubanné (> 45 % MS)  1er cycle début floraison (20/06)","ND","ND","ND","ND","ND","ND","ND","ND","ND",40]
[null,null,"Ensilage    Luzerne-Dactyle    Enrubanné (> 45 % MS)  2ème cycle (regain)",55,1.27,1.0900000000000001,0.71,0.62,103,78,1.5,2.8,41]
[null,null,"Ensilage    Luzerne-Dactyle    Préfané (35 % MS)  1er cycle  épaison (10/06)",33,1.1599999999999999,1.1200000000000001,0.73,0.64,98,65,1.5,2.4,35]
[null,null,"Ensilage    Luzerne-Dactyle    Préfané (35 % MS)  1er cycle début épiaison (25/05)",33,1.21,1.01,0.8,0.73,113,71,1.5,2.4,34]
[null,null,"Ensilage    Luzerne-Dactyle    Préfané (35 % MS)  1er cycle début floraison (20/06)","ND","ND","ND","ND","ND","ND","ND","ND","ND",32]
[null,null,"Ensilage    Luzerne-Dactyle    Préfané (35 % MS)  2ème cycle (regain)",33,1.23,1.04,0.73,0.64,106,66,1.5,2.8,37]
[null,null,"Ensilage    Luzerne-Dactyle    Ressuyage (25 % MS)  1er cycle  épaison (10/06)",21,1.32,1.32,0.79,0.71,90,55,1.5,2.4,31]
[null,null,"Ensilage    Luzerne-Dactyle    Ressuyage (25 % MS)  1er cycle début épiaison (25/05)",21,1.22,1.22,0.87,0.8,102,60,1.5,2.4,30]
[null,null,"Ensilage    Luzerne-Dactyle    Ressuyage (25 % MS)  1er cycle début floraison (20/06)","ND","ND","ND","ND","ND","ND","ND","ND","ND",36]
[null,null,"Ensilage    Luzerne-Dactyle    Ressuyage (25 % MS)  2ème cycle (regain)",21,1.23,1.17,0.78,0.69,98,56,1.5,2.8,33]
[null,null,"Ensilage    Maïs    Conditions normales 25  % MS  ",25,1.28,1.23,0.9,0.8,44,63,1.3,0.8,1]
[null,null,"Ensilage    Maïs    Conditions normales 30  % MS  ",30,1.28,1.1299999999999999,0.9,0.8,42,65,1.3,0.8,2]
[null,null,"Ensilage    Maïs    Conditions normales 35  % MS  ",35,1.28,1.05,0.91,0.81,42,67,1.3,0.8,3]
[null,null,"Ensilage    Maïs    Mauvaises conditions < 30 % MS  ",25,1.5,1.26,0.85,0.73,65,66,1.3,0.8,5]
[null,null,"Ensilage    Maïs    Très bonnes conditions (> 35 % MS)  ",35,1.36,1,0.96,0.87,50,71,1.3,0.8,4]
[null,null,"Ensilage    Prairie naturelle    Enrubanné (> 45 % MS)  1er cycle  épaison ",55,1.46,1.1599999999999999,0.73,0.64,72,75,1.1000000000000001,1.7]
[null,null,"Ensilage    Prairie naturelle    Enrubanné (> 45 % MS)  1er cycle début épiaison ",55,1.4,1.03,0.82,0.75,96,88,1.4,1.8]
[null,null,"Ensilage    Prairie naturelle    Enrubanné (> 45 % MS)  1er cycle début floraison ",55,1.59,1.32,0.63,0.53,61,66,0.9,1.3]
[null,null,"Ensilage    Prairie naturelle    Enrubanné (> 45 % MS)  2ème cycle (regain)",55,1.33,1,0.84,0.77,135,103,1.4,2.9]
[null,null,"Ensilage    Prairie naturelle    Préfané (35 % MS)  1er cycle  épaison",33,1.68,1.1299999999999999,0.75,0.66,75,66,1.1000000000000001,1.7]
[null,null,"Ensilage    Prairie naturelle    Préfané (35 % MS)  1er cycle début épiaison)",33,1.54,1.02,0.85,0.78,96,75,1.4,1.8]
[null,null,"Ensilage    Prairie naturelle    Préfané (35 % MS)  1er cycle début floraison","ND","ND","ND","ND","ND","ND","ND","ND","ND"]
[null,null,"Ensilage    Prairie naturelle    Préfané (35 % MS)  2ème cycle (regain)",33,1.39,1,0.86,0.79,131,86,1.4,2.9]
[null,null,"Ensilage    Prairie naturelle    Ressuyage (25 % MS)  1er cycle  épaison ",21,1.46,1.29,0.81,0.73,71,59,1.1000000000000001,1.7]
[null,null,"Ensilage    Prairie naturelle    Ressuyage (25 % MS)  1er cycle début épiaison",20,1.41,1.24,0.92,0.86,88,65,1.4,1.8]
[null,null,"Ensilage    Prairie naturelle    Ressuyage (25 % MS)  1er cycle début floraison","ND","ND","ND","ND","ND","ND","ND","ND","ND"]
[null,null,"Ensilage    Prairie naturelle    Ressuyage (25 % MS)  2ème cycle (regain)",21,1.35,1.17,0.93,0.87,121,74,1.4,2.9]
[null,null,"Ensilage    Ray Grass Italien    Enrubanné (> 45 % MS)  1er cycle  épaison (10/06)",55,1.48,1.21,0.72,0.64,52,67,1.4,1.8,63]
[null,null,"Ensilage    Ray Grass Italien    Enrubanné (> 45 % MS)  1er cycle début épiaison (25/05)",55,1.37,1.1000000000000001,0.81,0.74,67,76,1.6,1.8,62]
[null,null,"Ensilage    Ray Grass Italien    Enrubanné (> 45 % MS)  1er cycle début floraison (20/06)","ND","ND","ND","ND","ND","ND","ND","ND","ND",64]
[null,null,"Ensilage    Ray Grass Italien    Enrubanné (> 45 % MS)  2ème cycle (regain)",55,1.42,1.1499999999999999,0.71,0.63,78,75,1.6,1.8,65]
[null,null,"Ensilage    Ray Grass Italien    Préfané (35 % MS)  1er cycle  épaison (10/06)",33,1.62,1.18,0.74,0.67,57,59,1.4,1.8,59]
[null,null,"Ensilage    Ray Grass Italien    Préfané (35 % MS)  1er cycle début épiaison (25/05)",33,1.39,1.08,0.83,0.77,70,65,1.6,1.8,58]
[null,null,"Ensilage    Ray Grass Italien    Préfané (35 % MS)  1er cycle début floraison (20/06)","ND","ND","ND","ND","ND","ND","ND","ND","ND",60]
[null,null,"Ensilage    Ray Grass Italien    Préfané (35 % MS)  2ème cycle (regain)",33,1.49,1.1299999999999999,0.72,0.64,80,64,1.6,1.8,61]
[null,null,"Ensilage    Ray Grass Italien    Ressuyage (25 % MS)  1er cycle  épaison (10/06)",21,1.44,1.35,0.81,0.73,54,51,1.4,1.8,55]
[null,null,"Ensilage    Ray Grass Italien    Ressuyage (25 % MS)  1er cycle début épiaison (25/05)",21,1.36,1.3,0.9,0.84,65,55,1.6,1.8,54]
[null,null,"Ensilage    Ray Grass Italien    Ressuyage (25 % MS)  1er cycle début floraison (20/06)","ND","ND","ND","ND","ND","ND","ND","ND","ND",56]
[null,null,"Ensilage    Ray Grass Italien    Ressuyage (25 % MS)  2ème cycle (regain)",21,1.39,1.31,0.79,0.71,74,53,1.6,1.8,57]
[null,null,"Ensilage    Trèfle-Ray Grass    Enrubanné (> 45 % MS)  1er cycle  épaison (10/06)",55,1.33,1.19,0.76,0.69,86,77,1.7,2.8,51]
[null,null,"Ensilage    Trèfle-Ray Grass    Enrubanné (> 45 % MS)  1er cycle début épiaison (25/05)",55,1.26,1.08,0.83,0.76,103,84,1.7,2.8,50]
[null,null,"Ensilage    Trèfle-Ray Grass    Enrubanné (> 45 % MS)  1er cycle début floraison (20/06)","ND","ND","ND","ND","ND","ND","ND","ND","ND",52]
[null,null,"Ensilage    Trèfle-Ray Grass    Enrubanné (> 45 % MS)  2ème cycle (regain)",55,1.24,1.0900000000000001,0.74,0.66,95,78,1.7,2.8,53]
[null,null,"Ensilage    Trèfle-Ray Grass    Préfané (35 % MS)  1er cycle  épaison (10/06)",33,1.45,1.17,0.77,0.7,87,72,1.7,2.8,47]
[null,null,"Ensilage    Trèfle-Ray Grass    Préfané (35 % MS)  1er cycle début épiaison (25/05)",33,1.3,1.08,0.84,0.78,103,78,1.7,2.8,46]
[null,null,"Ensilage    Trèfle-Ray Grass    Préfané (35 % MS)  1er cycle début floraison (20/06)","ND","ND","ND","ND","ND","ND","ND","ND","ND",48]
[null,null,"Ensilage    Trèfle-Ray Grass    Préfané (35 % MS)  2ème cycle (regain)",33,1.46,1.1399999999999999,0.76,0.69,80,72,1.7,2.8,49]
[null,null,"Ensilage    Trèfle-Ray Grass    Ressuyage (25 % MS)  1er cycle  épaison (10/06)",21,1.29,1.33,0.86,0.79,82,56,1,2.8,43]
[null,null,"Ensilage    Trèfle-Ray Grass    Ressuyage (25 % MS)  1er cycle début épiaison (25/05)",21,1.24,1.28,0.93,0.88,93,60,1.7,2.8,42]
[null,null,"Ensilage    Trèfle-Ray Grass    Ressuyage (25 % MS)  1er cycle début floraison (20/06)","ND","ND","ND","ND","ND","ND","ND","ND","ND",44]
[null,null,"Ensilage    Trèfle-Ray Grass    Ressuyage (25 % MS)  2ème cycle (regain)",21,1.21,1.1599999999999999,0.82,0.74,91,86,1.7,2.8,45]
[null,null,"Fané < 10 jours 3è coupe",85,1.28,1.1599999999999999,0.6,0.5,119,86,1.3,4.3,149]
[null,null,"Fané par beau temps 3è coupe",85,1.18,1.06,0.68,0.57999999999999996,122,92,1.3,4.3,145]
[null,null,"Foin    Fétuque élevée    Fané au sol < 10 jours)  1er cycle  épaison (10/06)",85,1.52,1.2,0.64,0.55000000000000004,65,74,1.6,1.1000000000000001,99]
[null,null,"Foin    Fétuque élevée    Fané au sol < 10 jours)  1er cycle début épiaison (25/05)",85,"ND","ND","ND","ND","ND","ND","ND","ND",98]
[null,null,"Foin    Fétuque élevée    Fané au sol < 10 jours)  1er cycle début floraison (20/06)",85,1.82,1.36,0.55000000000000004,0.45,56,65,1.4,1.1000000000000001,100]
[null,null,"Foin    Fétuque élevée    Fané au sol < 10 jours)  2ème cycle (regain)",85,1.45,1.1499999999999999,0.67,0.57999999999999996,80,82,1.9,1.4,101]
[null,null,"Foin    Fétuque élevée    Fané au sol par beau temps  1er cycle  épaison (10/06)",85,1.4,1.1100000000000001,0.66,0.57999999999999996,69,76,1.6,1.1000000000000001,95]
[null,null,"Foin    Fétuque élevée    Fané au sol par beau temps  1er cycle début épiaison (25/05)",85,"ND","ND","ND","ND","ND","ND","ND","ND",94]
[null,null,"Foin    Fétuque élevée    Fané au sol par beau temps  1er cycle début floraison (20/06)",85,1.64,1.27,0.56999999999999995,0.47,59,68,1.4,1.1000000000000001,96]
[null,null,"Foin    Fétuque élevée    Fané au sol par beau temps  2ème cycle (regain)",85,1.33,1.06,0.69,0.61,84,85,1.9,1.4,97]
[null,null,"Foin    Fétuque élevée    Ventilé (en grange)  1er cycle  épaison (10/06)",85,1.3,1.1100000000000001,0.67,0.57999999999999996,69,77,1.6,1.1000000000000001,91]
[null,null,"Foin    Fétuque élevée    Ventilé (en grange)  1er cycle début épiaison (25/05)",85,1.22,1.04,0.73,0.65,89,87,1.7,1.1000000000000001,90]
[null,null,"Foin    Fétuque élevée    Ventilé (en grange)  1er cycle début floraison (20/06)","ND","ND","ND","ND","ND","ND","ND","ND","ND",92]
[null,null,"Foin    Fétuque élevée    Ventilé (en grange)  2ème cycle (regain)","ND","ND","ND","ND","ND","ND","ND","ND","ND",93]
[null,null,"Foin    Luzerne    Fané au sol < 10 jours)  1er cycle  épaison (10/06)",85,1.34,1.1499999999999999,0.55000000000000004,0.44,103,81,1.3,3.8,147]
[null,null,"Foin    Luzerne    Fané au sol < 10 jours)  1er cycle début épiaison (25/05)",85,1.3,1.1399999999999999,0.6,0.49,111,86,1.4,3.8,146]
[null,null,"Foin    Luzerne    Fané au sol < 10 jours)  1er cycle début floraison (20/06)","ND","ND","ND","ND","ND","ND","ND","ND","ND",149]
[null,null,"Foin    Luzerne    Fané au sol < 10 jours)  2ème cycle (regain)",85,1.27,1.1399999999999999,0.59,0.49,111,74,1.3,3.3,148]
[null,null,"Foin    Luzerne    Fané au sol par beau temps  1er cycle  épaison (10/06)",85,1.23,1.05,0.62,0.52,107,87,1.3,3.8,143]
[null,null,"Foin    Luzerne    Fané au sol par beau temps  1er cycle début épiaison (25/05)",85,1.2,1.04,0.67,0.57999999999999996,114,91,1.4,3.8,142]
[null,null,"Foin    Luzerne    Fané au sol par beau temps  1er cycle début floraison (20/06)","ND","ND","ND","ND","ND","ND","ND","ND","ND",145]
[null,null,"Foin    Luzerne    Fané au sol par beau temps  2ème cycle (regain)",85,1.17,1.04,0.67,0.56999999999999995,115,90,1.3,3.3,144]
[null,null,"Foin    Luzerne    Ventilé (en grange)  1er cycle  épaison (10/06)",85,1.1399999999999999,0.95,0.66,0.56000000000000005,113,91,1.4,3.8,139]
[null,null,"Foin    Luzerne    Ventilé (en grange)  1er cycle début épiaison (25/05)",85,1.1000000000000001,0.92,0.71,0.63,122,96,1.4,3.8,138]
[null,null,"Foin    Luzerne    Ventilé (en grange)  1er cycle début floraison (20/06)","ND","ND","ND","ND","ND","ND","ND","ND","ND",140]
[null,null,"Foin    Luzerne    Ventilé (en grange)  2ème cycle (regain)","ND","ND","ND","ND","ND","ND","ND","ND","ND",141]
[null,null,"Foin    Luzerne-Dactyle    Fané au sol < 10 jours)  1er cycle  épaison (10/06)",85,1.4,1.1599999999999999,0.66,0.56000000000000005,99,86,1.4,2.2999999999999998,111]
[null,null,"Foin    Luzerne-Dactyle    Fané au sol < 10 jours)  1er cycle début épiaison (25/05)","ND","ND","ND","ND","ND","ND","ND","ND","ND",110]
[null,null,"Foin    Luzerne-Dactyle    Fané au sol < 10 jours)  1er cycle début floraison (20/06)",85,1.6,1.27,0.56999999999999995,0.46,80,74,1.2,2.2999999999999998,112]
[null,null,"Foin    Luzerne-Dactyle    Fané au sol < 10 jours)  2ème cycle (regain)",85,1.33,1.1299999999999999,0.63,0.54,99,79,1.4,2.4,113]
[null,null,"Foin    Luzerne-Dactyle    Fané au sol par beau temps  1er cycle  épaison (10/06)",85,1.28,1.06,0.71,0.63,102,90,1.4,2.2999999999999998,107]
[null,null,"Foin    Luzerne-Dactyle    Fané au sol par beau temps  1er cycle début épiaison (25/05)","ND","ND","ND","ND","ND","ND","ND","ND","ND",106]
[null,null,"Foin    Luzerne-Dactyle    Fané au sol par beau temps  1er cycle début floraison (20/06)",85,1.45,1.17,0.61,0.51,83,79,1.2,2.2999999999999998,108]
[null,null,"Foin    Luzerne-Dactyle    Fané au sol par beau temps  2ème cycle (regain)",85,1.22,1.03,0.68,0.59,103,89,1.4,2.4,109]
[null,null,"Foin    Luzerne-Dactyle    Ventilé (en grange)  1er cycle  épaison (10/06)",85,1.21,1.01,0.71,0.62,102,90,1.4,2.2999999999999998,103]
[null,null,"Foin    Luzerne-Dactyle    Ventilé (en grange)  1er cycle début épiaison (25/05)",85,1.1000000000000001,0.93,0.76,0.69,123,99,1.5,2.4,102]
[null,null,"Foin    Luzerne-Dactyle    Ventilé (en grange)  1er cycle début floraison (20/06)","ND","ND","ND","ND","ND","ND","ND","ND","ND",104]
[null,null,"Foin    Luzerne-Dactyle    Ventilé (en grange)  2ème cycle (regain)","ND","ND","ND","ND","ND","ND","ND","ND","ND",105]
[null,null,"Foin    Prairie naturelle    Fané au sol < 10 jours)  1er cycle  épaison (10/06)",85,1.44,1.1599999999999999,0.7,0.61,67,80,1.4,1.4]
[null,null,"Foin    Prairie naturelle    Fané au sol < 10 jours)  1er cycle début épiaison (25/05)",85,1.36,1.05,0.7,0.61,67,80,1.2,1.3]
[null,null,"Foin    Prairie naturelle    Fané au sol < 10 jours)  1er cycle début floraison (20/06)",85,1.66,1.29,0.61,0.51,54,70,1,1]
[null,null,"Foin    Prairie naturelle    Fané au sol < 10 jours)  2ème cycle (regain)",85,1.27,1.04,0.78,0.7,134,112,1.4,2]
[null,null,"Foin    Prairie naturelle    Fané au sol par beau temps  1er cycle  épaison (10/06)",85,1.32,1.07,0.73,0.64,71,83,1.2,1.3]
[null,null,"Foin    Prairie naturelle    Fané au sol par beau temps  1er cycle début épiaison (25/05)",85,1.25,0.97,0.82,0.74,96,97,1.4,1.4]
[null,null,"Foin    Prairie naturelle    Fané au sol par beau temps  1er cycle début floraison (20/06)",85,1.49,1.2,0.63,0.53,58,72,1,1]
[null,null,"Foin    Prairie naturelle    Fané au sol par beau temps  2ème cycle (regain)",85,1.17,0.95,0.83,0.75,138,116,1.4,2]
[null,null,"Foin    Prairie naturelle    Ventilé (en grange)  1er cycle  épaison (10/06)",85,1.22,1.07,0.72,0.64,71,82,1.2,1.3]
[null,null,"Foin    Prairie naturelle    Ventilé (en grange)  1er cycle début épiaison (25/05)",85,1.1599999999999999,0.97,0.82,0.74960000000000004,96,97,1.4,1.4]
[null,null,"Foin    Prairie naturelle    Ventilé (en grange)  1er cycle début floraison (20/06)","ND","ND","ND","ND","ND","ND","ND","ND","ND",80]
[null,null,"Foin    Prairie naturelle    Ventilé (en grange)  2ème cycle (regain)",85,1.0900000000000001,0.95,0.81,0.73,117,107,1.4,2,81]
[null,null,"Foin    Ray Grass Italien    Fané au sol < 10 jours)  1er cycle  épaison (10/06)",85,1.49,1.17,0.71,0.62,50,72,1.4,1.4,135]
[null,null,"Foin    Ray Grass Italien    Fané au sol < 10 jours)  1er cycle début épiaison (25/05)","ND","ND","ND","ND","ND","ND","ND","ND","ND",134]
[null,null,"Foin    Ray Grass Italien    Fané au sol < 10 jours)  1er cycle début floraison (20/06)",85,1.79,1.35,0.6,0.5,32,59,1.2,1.4,136]
[null,null,"Foin    Ray Grass Italien    Fané au sol < 10 jours)  2ème cycle (regain)",85,1.46,1.1599999999999999,0.67,0.57999999999999996,73,80,1.6,1.4,137]
[null,null,"Foin    Ray Grass Italien    Fané au sol par beau temps  1er cycle  épaison (10/06)",85,1.36,1.08,0.74,0.66,54,75,1.4,1.4,131]
[null,null,"Foin    Ray Grass Italien    Fané au sol par beau temps  1er cycle début épiaison (25/05)","ND","ND","ND","ND","ND","ND","ND","ND","ND",130]
[null,null,"Foin    Ray Grass Italien    Fané au sol par beau temps  1er cycle début floraison (20/06)",85,1.62,1.26,0.61,0.52,36,61,1.2,1.4,132]
[null,null,"Foin    Ray Grass Italien    Fané au sol par beau temps  2ème cycle (regain)",85,1.35,1.07,0.7,0.61,76,82,1.6,1.4,133]
[null,null,"Foin    Ray Grass Italien    Ventilé (en grange)  1er cycle  épaison (10/06)",85,1.27,1.08,0.74,0.66,54,75,1.4,1.4,127]
[null,null,"Foin    Ray Grass Italien    Ventilé (en grange)  1er cycle début épiaison (25/05)",85,1.19,1.01,0.81,0.75,70,85,1.6,1.4,126]
[null,null,"Foin    Ray Grass Italien    Ventilé (en grange)  1er cycle début floraison (20/06)","ND","ND","ND","ND","ND","ND","ND","ND","ND",128]
[null,null,"Foin    Ray Grass Italien    Ventilé (en grange)  2ème cycle (regain)","ND","ND","ND","ND","ND","ND","ND","ND","ND",129]
[null,null,"Foin    Trèfle-Ray Grass    Fané au sol < 10 jours)  1er cycle  épaison (10/06)",85,1.31,1.1599999999999999,0.73,0.59,93,84,1.5,2.2999999999999998,123]
[null,null,"Foin    Trèfle-Ray Grass    Fané au sol < 10 jours)  1er cycle début épiaison (25/05)","ND","ND","ND","ND","ND","ND","ND","ND","ND",122]
[null,null,"Foin    Trèfle-Ray Grass    Fané au sol < 10 jours)  1er cycle début floraison (20/06)",85,1.54,1.29,0.61,0.51,70,72,1.3,2.2000000000000002,124]
[null,null,"Foin    Trèfle-Ray Grass    Fané au sol < 10 jours)  2ème cycle (regain)",85,1.25,1.1100000000000001,0.65,0.56000000000000005,92,83,1.5,2.4,125]
[null,null,"Foin    Trèfle-Ray Grass    Fané au sol par beau temps  1er cycle  épaison (10/06)",85,1.2,1.07,0.74,0.66,92,88,1.5,2.2999999999999998,119]
[null,null,"Foin    Trèfle-Ray Grass    Fané au sol par beau temps  1er cycle début épiaison (25/05)","ND","ND","ND","ND","ND","ND","ND","ND","ND",118]
[null,null,"Foin    Trèfle-Ray Grass    Fané au sol par beau temps  1er cycle début floraison (20/06)",85,1.4,1.2,0.63,0.54,75,76,1.2,2.2000000000000002,120]
[null,null,"Foin    Trèfle-Ray Grass    Fané au sol par beau temps  2ème cycle (regain)",85,1.1399999999999999,1.01,0.69,0.61,97,87,1.5,2.4,121]
[null,null,"Foin    Trèfle-Ray Grass    Ventilé (en grange)  1er cycle  épaison (10/06)",85,1.21,1.07,0.75,0.67,86,87,1.4,2.2999999999999998,115]
[null,null,"Foin    Trèfle-Ray Grass    Ventilé (en grange)  1er cycle début épiaison (25/05)",85,1.07,0.96,0.81,0.75,108,97,1.6,2.4,114]
[null,null,"Foin    Trèfle-Ray Grass    Ventilé (en grange)  1er cycle début floraison (20/06)","ND","ND","ND","ND","ND","ND","ND","ND","ND",116]
[null,null,"Foin    Trèfle-Ray Grass    Ventilé (en grange)  2ème cycle (regain)","ND","ND","ND","ND","ND","ND","ND","ND","ND",117]
[null,null,"Mon fourrage    N°1",{"$f":"#REF!","v":{"$error":"#REF!"}},{"$f":"#REF!","v":{"$error":"#REF!"}},null,{"$f":"#REF!","v":{"$error":"#REF!"}},null,{"$f":"#REF!","v":{"$error":"#REF!"}},{"$f":"#REF!","v":{"$error":"#REF!"}},{"$f":"#REF!","v":{"$error":"#REF!"}},{"$f":"#REF!","v":{"$error":"#REF!"}},150]
[null,null,"Mon fourrage    N°2",{"$f":"#REF!","v":{"$error":"#REF!"}},{"$f":"#REF!","v":{"$error":"#REF!"}},null,{"$f":"#REF!","v":{"$error":"#REF!"}},null,{"$f":"#REF!","v":{"$error":"#REF!"}},{"$f":"#REF!","v":{"$error":"#REF!"}},{"$f":"#REF!","v":{"$error":"#REF!"}},{"$f":"#REF!","v":{"$error":"#REF!"}},151]
[null,null,"Mon fourrage    N°3",{"$f":"#REF!","v":{"$error":"#REF!"}},{"$f":"#REF!","v":{"$error":"#REF!"}},null,{"$f":"#REF!","v":{"$error":"#REF!"}},null,{"$f":"#REF!","v":{"$error":"#REF!"}},{"$f":"#REF!","v":{"$error":"#REF!"}},{"$f":"#REF!","v":{"$error":"#REF!"}},{"$f":"#REF!","v":{"$error":"#REF!"}},152]
[null,null,"Paille    Avoine      ",88,2.2999999999999998,1.7,0.5,0.39,20,48,0.5,1.4,154]
[null,null,"Paille    Blé      ",88,2.41,1.8,0.42,0.31,22,44,0.5,0.8,153]
[null,null,"Paille    Orge      ",88,2.4700000000000002,1.8,0.44,0.33,24,46,0.5,1.4,163]
[null,null,"Paille    Paille traitée Ammoniac      ",88,1.74,1.3,0.57999999999999996,0.48,43,54,0.5,1.4,160]
[null,null,"Paille    Triticale      ",88,2.41,1.8,0.42,0.31,22,44,0.5,0.8,159]
[null,null,"Pâture    Avoine      ",15,0.94,0.95,1,0.98,75,87,2.2000000000000002,1.9,164]
[null,null,"Pâture    Betterave (distribuée)      ",13,0.91,1.2,1.1499999999999999,1.1599999999999999,62,86,1.1000000000000001,0.5,155]
[null,null,"Pâture    Colza fourrager      ",13,0.91,0.93,0.91,0.89,124,97,2.2999999999999998,4.7,157]
[null,null,"Pâture    Navet      ",10,0.9,0.7,1.1200000000000001,1.1200000000000001,68,84,1.8,1.1000000000000001,156]
[null,null,"Pâture    Pré       Déprimage",16,0.9,0.9,1,0.95,140,105,2.9,2.2999999999999998,158]
[null,null,"Pâture    Pré       Fin Printemps",20,1.25,1.2,0.8,0.7,75,85,2.5,2,162]
[null,null,"Pâture    Pré       Printemps",17,0.95,0.95,0.95,0.9,110,100,2.8,2.1,161]
[null,null,"Pâture    Pré       Repousse",19,1.05,1.05,0.85,0.8,100,90,2.5,2]
[null,null,"Pâture    Trèfle blanc      ",10,0.83,0.87,1.0900000000000001,1.06,161,106,1.9,3.9]
[null,null,"Pâture    Vesce      ",19,0.88,0.91,0.89,0.84,154,99,2.2999999999999998,3.7]
[]
[]
[]
[]
[null,null,null,"MS","UEM","UEB","UFL","UFV","PDIN","PDIE","P","Ca"]

{"sheet":"CONCENTRE","index":6,"n_rows":75,"n_cols":20,"rows_kept":75,"cut":false,"hidden":false,"merged":[[0,1,0,16],[3,8,3,16],[14,4,14,8],[4,9,6,11],[12,1,12,3],[5,1,5,3],[5,4,6,8],[12,4,13,8],[8,10,9,10],[7,4,7,8],[16,13,17,13],[13,13,14,13],[5,13,5,16],[1,1,1,16],[15,10,16,10],[6,13,7,13],[6,14,7,16]]}
[null,"ALIM'ovins(v. 5.1) "]
[null,"Rationnement des ovins "]
[]
[null,null,null,null,null,null,null,null,"Ration"]
[null,null,null,null,null,null,null,null,null,"3 Saisissez les quantités brutes distribuées  ou cliquez sur \"Mélange\""]
[null,"1 Cliquez sur les flèches pour faire votre choix",null,null,"CONCENTRE N°1",null,null,null,null,null,null,null,null,"Valeurs des concentrés"]
[null,null,null,null,null,null,null,null,null,null,null,null,null,{"$f":"IF(K9=\"\",\"\",C10)","v":""},{"$f":"IF(K16=\"\",\"\",C17)","v":""},null,null,null,null,{"$f":"K16/(K9+K16)","v":{"$error":"#DIV/0!"}}]
[null,"Catégorie ",null,null,"Valeurs alimentaires / kg brut",null,null,null,null,null,null,null,null,null,null,null,null,null,null,{"$f":"K9/(K9+K16)","v":{"$error":"#DIV/0!"}}]
[null,null,null,null,"U.F.L.","P.D.I.N.","P.D.I.E.","Pabs","Caabs",null,null,null,null,null,null,null,null,null,{"$f":"IF(C8=\"\",0,IF(K16=\"\",1,(K9*E10)/((K9*E10)+(E17*K16))))","v":0},{"$f":"IF(C8=\"\",0,IF(K16=\"\",1,(K9*F10)/((K9*F10)+(F17*K16))))","v":0}]
[null,"Espèce",null,null,{"$f":"IF(C8=\"Mélange fermier\",COUT!F23,IF(C8=\"\",\"\",IF($C$8=\"Mon concentré\",VLOOKUP($C$10,NOUVEAU!R22:AA35,3),VLOOKUP($C$10,$C$42:$I$79,3))))","v":""},{"$f":"IF(C8=\"Mélange fermier\",COUT!H23,IF(C8=\"\",\"\",IF($C$8=\"Mon concentré\",VLOOKUP($C$10,NOUVEAU!R22:AA35,5),VLOOKUP($C$10,$C$42:$I$79,4))))","v":""},{"$f":"IF(C8=\"Mélange fermier\",COUT!I23,IF(C8=\"\",\"\",IF($C$8=\"Mon concentré\",VLOOKUP($C$10,NOUVEAU!R22:AA35,6),VLOOKUP($C$10,$C$42:$I$79,5))))","v":""},{"$f":"IF(C8=\"Mélange fermier\",COUT!J23,IF(C8=\"\",\"\",IF($C$8=\"Mon concentré\",VLOOKUP($C$10,NOUVEAU!R22:AA35,7),VLOOKUP($C$10,$C$42:$I$79,6))))","v":""},{"$f":"IF(C8=\"Mélange fermier\",COUT!K23,IF(C8=\"\",\"\",IF($C$8=\"Mon concentré\",VLOOKUP($C$10,NOUVEAU!R22:AA35,8),VLOOKUP($C$10,$C$42:$I$79,7))))","v":""},null,null,null,null,null,null,null,null,null,{"$f":"IF(C15=\"\",0,IF(K9=\"\",1,(K16*E17)/((K16*E17)+(K9*E10))))","v":0},{"$f":"IF(C15=\"\",0,IF(K9=\"\",1,(K16*F17)/((K16*F17)+(K9*F10))))","v":0}]
[null,null,null,null,null,null,null,null,null,null,null,null,null,null,"UFL",null,"PDIN"]
[]
[null,"2 Cliquez sur les flèches pour faire votre choix",null,null,"CONCENTRE N°2",null,null,null,null,null,null,null,null,{"$f":"IF(K9=\"\",\"\",\"Concentré 1\")","v":""}]
[null,null,null,null,null,null,null,null,null,null,null,null,null,{"$f":"IF(K9=\"\",\"\",C10)","v":""}]
[null,"Catégorie ",null,null,"Valeurs alimentaires / kg brut"]
[null,null,null,null,"U.F.L.","P.D.I.N.","P.D.I.E.","Pabs","Caabs",null,null,null,null,{"$f":"IF(K16=\"\",\"\",\"Concentré 2\")","v":""}]
[null,"Espèce",null,null,{"$f":"IF(C15=\"Mélange fermier\",COUT!F23,IF(C15=\"\",\"\",IF($C$15=\"Mon concentré\",VLOOKUP($C$17,NOUVEAU!R22:AA45,3),VLOOKUP($C$17,$C$42:$I$79,3))))","v":""},{"$f":"IF(C15=\"Mélange fermier\",COUT!H23,IF(C15=\"\",\"\",IF($C$15=\"Mon concentré\",VLOOKUP($C$17,NOUVEAU!R22:AA45,5),VLOOKUP($C$17,$C$42:$I$79,4))))","v":""},{"$f":"IF(C15=\"Mélange fermier\",COUT!I23,IF(C15=\"\",\"\",IF($C$15=\"Mon concentré\",VLOOKUP($C$17,NOUVEAU!R22:AA45,6),VLOOKUP($C$17,$C$42:$I$79,5))))","v":""},{"$f":"IF(C15=\"Mélange fermier\",COUT!J23,IF(C15=\"\",\"\",IF($C$15=\"Mon concentré\",VLOOKUP($C$17,NOUVEAU!R22:AA45,7),VLOOKUP($C$17,$C$42:$I$79,6))))","v":""},{"$f":"IF(C15=\"Mélange fermier\",COUT!K23,IF(C15=\"\",\"\",IF($C$15=\"Mon concentré\",VLOOKUP($C$17,NOUVEAU!R22:AA45,8),VLOOKUP($C$17,$C$42:$I$79,7))))","v":""},null,null,null,null,{"$f":"IF(K16=\"\",\"\",C17)","v":""}]
[]
[]
[]
[]
[null,null,null,null,{"$f":"IF($C$8=\"Mélange fermier\",\"Mélange fermier\",IF($C$8=\"Céréale\",F22,IF($C$8=\"Tourteau\",G22,IF($C$8=\"Divers\",K22,IF($C$8=\"Mon concentré\",NOUVEAU!R22,I22)))))","v":"Pois"},"Blé","Colza 35",null,"Pois",null,"Drêches de brasserie"]
[null,null,"Céréale",null,{"$f":"IF($C$8=\"Mélange fermier\",\"\",IF($C$8=\"Céréale\",F23,IF($C$8=\"Tourteau\",G23,IF($C$8=\"Divers\",K23,IF($C$8=\"Mon concentré\",NOUVEAU!R23,I23)))))","v":"Lupin"},"Orge","Soja 48",null,"Lupin",null,"Graines de Colza"]
[null,null,"Tourteau",null,{"$f":"IF($C$8=\"Mélange fermier\",\"\",IF($C$8=\"Céréale\",F24,IF($C$8=\"Tourteau\",G24,IF($C$8=\"Divers\",K24,IF($C$8=\"Mon concentré\",NOUVEAU!R24,I24)))))","v":"Féverole"},"Avoine","Tournesol",null,"Féverole",null,"Drêches de blé"]
[null,null,"Protéagineux",null,{"$f":"IF($C$8=\"Mélange fermier\",\"\",IF($C$8=\"Céréale\",F25,IF($C$8=\"Tourteau\",G25,IF($C$8=\"Divers\",K25,IF($C$8=\"Mon concentré\",NOUVEAU!R25,I25)))))","v":"Vesce"},"Triticale","Lin",null,"Vesce",null,"Huile de Colza"]
[null,null,"Divers",null,{"$f":"IF($C$8=\"Mélange fermier\",\"\",IF($C$8=\"Céréale\",F26,IF($C$8=\"Tourteau\",G26,IF($C$8=\"Divers\",K26,IF($C$8=\"Mon concentré\",NOUVEAU!R26,I26)))))","v":"Soja extrudé"},"Seigle","Arachide",null,"Soja extrudé",null,"Luzerne deshydratée"]
[null,null,"Mon concentré",null,{"$f":"IF($C$8=\"Mélange fermier\",\"\",IF($C$8=\"Céréale\",F27,IF($C$8=\"Tourteau\",G27,IF($C$8=\"Divers\",K27,IF($C$8=\"Mon concentré\",NOUVEAU!R27,I27)))))","v":" "},"Maïs grain","Coton déshuilé",null," ",null,"Mélasse"]
[null,null,"Mélange fermier",null,{"$f":"IF($C$8=\"Mélange fermier\",\"\",IF($C$8=\"Céréale\",F28,IF($C$8=\"Tourteau\",G28,IF($C$8=\"Divers\",K28,IF($C$8=\"Mon concentré\",NOUVEAU!R28,I28)))))","v":" "},"Sarrazin","Tournesol décortiqué",null," ",null,"Lait écrémé en poudre"]
[null,null,null,null,{"$f":"IF($C$8=\"Mélange fermier\",\"\",IF($C$8=\"Céréale\",F29,IF($C$8=\"Tourteau\",G29,IF($C$8=\"Divers\",K29,IF($C$8=\"Mon concentré\",NOUVEAU!R29,I29)))))","v":" "},"Sorgho","Soja tanné",null," ",null,"Pulpe de Betterave"]
[]
[null,null,null,null,{"$f":"IF($C$15=\"Mélange fermier\",\"Mélange fermier\",IF($C$15=\"Céréale\",F31,IF($C$15=\"Tourteau\",G31,IF($C$15=\"Divers\",K31,IF($C$15=\"Mon concentré\",NOUVEAU!R22,I31)))))","v":"Pois"},"Blé","Colza 35",null,"Pois",null,"Drêches de brasserie"]
[null,null,"Céréale",null,{"$f":"IF($C$15=\"Mélange fermier\",\"\",IF($C$15=\"Céréale\",F32,IF($C$15=\"Tourteau\",G32,IF($C$15=\"Divers\",K32,IF($C$15=\"Mon concentré\",NOUVEAU!R23,I32)))))","v":"Lupin"},"Orge","Soja 48",null,"Lupin",null,"Graines de Colza"]
[null,null,"Tourteau",null,{"$f":"IF($C$15=\"Mélange fermier\",\"\",IF($C$15=\"Céréale\",F33,IF($C$15=\"Tourteau\",G33,IF($C$15=\"Divers\",K33,IF($C$15=\"Mon concentré\",NOUVEAU!R24,I33)))))","v":"Féverole"},"Avoine","Tournesol",null,"Féverole",null,"Drêches de blé"]
[null,null,"Protéagineux",null,{"$f":"IF($C$15=\"Mélange fermier\",\"\",IF($C$15=\"Céréale\",F34,IF($C$15=\"Tourteau\",G34,IF($C$15=\"Divers\",K34,IF($C$15=\"Mon concentré\",NOUVEAU!R25,I34)))))","v":"Vesce"},"Triticale","Lin",null,"Vesce",null,"Huile de Colza"]
[null,null,"Divers",null,{"$f":"IF($C$15=\"Mélange fermier\",\"\",IF($C$15=\"Céréale\",F35,IF($C$15=\"Tourteau\",G35,IF($C$15=\"Divers\",K35,IF($C$15=\"Mon concentré\",NOUVEAU!R26,I35)))))","v":"Soja extrudé"},"Seigle","Arachide",null,"Soja extrudé",null,"Luzerne deshydratée"]
[null,null,"Mes aliments",null,{"$f":"IF($C$15=\"Mélange fermier\",\"\",IF($C$15=\"Céréale\",F36,IF($C$15=\"Tourteau\",G36,IF($C$15=\"Divers\",K36,IF($C$15=\"Mon concentré\",NOUVEAU!R27,I36)))))","v":" "},"Maïs grain","Coton déshuilé",null," ",null,"Mélasse"]
[null,null,null,null,{"$f":"IF($C$15=\"Mélange fermier\",\"\",IF($C$15=\"Céréale\",F37,IF($C$15=\"Tourteau\",G37,IF($C$15=\"Divers\",K37,IF($C$15=\"Mon concentré\",NOUVEAU!R28,I37)))))","v":" "},"Sarrazin","Tournesol décortiqué",null," ",null,"Lait écrémé en poudre"]
[null,null,null,null,{"$f":"IF($C$15=\"Mélange fermier\",\"\",IF($C$15=\"Céréale\",F38,IF($C$15=\"Tourteau\",G38,IF($C$15=\"Divers\",K38,IF($C$15=\"Mon concentré\",NOUVEAU!R29,I38)))))","v":" "},"Sorgho","Soja tanné",null," ",null,"Pulpe de Betterave"]
[]
[]
[null,null,"Catégorie","C","U.F.L.","P.D.I.N.","P.D.I.E.","Pabs","Caabs"]
[null,null,"Arachide",90,1,347,215,{"$f":"K42*(D42/100)","v":3.69},{"$f":"N42*(D42/100)","v":1.08},null,4.0999999999999996,null,null,1.2]
[null,null,"Avoine",88,0.77,61,61,{"$f":"K43*(D43/100)","v":2.3760000000000003},{"$f":"N43*(D43/100)","v":0.61599999999999999},null,2.7,null,null,0.7]
[null,null,"Blé",87,1.02,70,89,{"$f":"K44*(D44/100)","v":2.262},{"$f":"N44*(D44/100)","v":0.34800000000000003},null,2.6,null,null,0.4]
[null,null,"Colza 35",89,0.85,219,138,{"$f":"K45*(D45/100)","v":8.1879999999999988},{"$f":"N45*(D45/100)","v":4.6280000000000001},null,9.1999999999999993,null,null,5.2]
[null,null,"Colza tanné",null,0.85,255,246,9.1999999999999993,5.2]
[null,null,"Corn gluten",null,0.93,127,102,6.8,1]
[null,null,"Coton",91,0.94,131,77,{"$f":"K48*(D48/100)","v":4.641},{"$f":"N48*(D48/100)","v":0.91},null,5.0999999999999996,null,null,1]
[null,null,"Coton déshuilé",null,0.8,254,173,7.9,1.5]
[null,null,"Drêches de blé",null,0.96,228,143,5.4,2]
[null,null,"Drêches de brasserie",92,0.76,178,157,{"$f":"K51*(D51/100)","v":4.5080000000000009},{"$f":"N51*(D51/100)","v":1.1960000000000002},null,4.9000000000000004,null,null,1.3]
[null,null,"Féverole",86,1.03,170,97,3.5259999999999998,0.77400000000000002,null,4.0999999999999996,null,null,0.9]
[null,null,"Graine de Colza",92,1.68,12,61,4.8760000000000003,2.5760000000000001,null,5.3,null,null,2.8]
[null,null,"Huile de colza",100,2.73,0,0,0,0,null,0,null,null,0]
[null,null,"Lin",89,0.88,227,179,5.34,2.492,null,6,null,null,2.8]
[null,null,"Lupin",89,1.18,213,106,2.8480000000000003,1.8690000000000002,null,3.2,null,null,2.1]
[null,null,"Luzerne déhydratée",91,0.62,103,91,1.7289999999999999,5.915,null,1.9,null,null,6.5]
[null,null,"Maïs grain",86,1.06,64,84,1.8920000000000001,0.25800000000000001,null,2.2000000000000002,null,null,0.3]
[null,null,"Mélasse",76,0.75,63,54,0.15200000000000002,0.38,null,0.2,null,null,0.5]
[null,null,"Orge",87,0.95,69,87,2.61,0.435,null,3,null,null,0.5]
[null,null,"Pois",86,1.04,130,83,2.9239999999999999,0.60199999999999998,null,3.4,null,null,0.7]
[null,null,"Poudre de lait écrémé",95,1.1499999999999999,196,75,9.2149999999999981,11.114999999999998,null,9.6999999999999993,null,null,11.7]
[null,null,"Pulpe de betterave",89,0.89,59,97,0.80100000000000005,2.67,null,0.9,null,null,3]
[null,null,"Sarrazin",87,0.81,77,82,2.262,0.435,null,2.6,null,null,0.5]
[null,null,"Seigle",87,1.03,59,85,2.262,0.60899999999999999,null,2.6,null,null,0.7]
[null,null,"Soja 48",88,1.06,331,229,4.4000000000000004,1.8480000000000001,null,5,null,null,2.1]
[null,null,"Soja extrudé",null,1.27,262,214,4.5999999999999996,2]
[null,null,"Soja tanné",null,1.06,389,374,5,2.1]
[null,null,"Son de blé",null,0.82,94,80,8.1999999999999993,0.9]
[null,null,"Sorgho",87,1.05,67,87,{"$f":"K70*(D70/100)","v":2.0880000000000001},{"$f":"N70*(D70/100)","v":0.17400000000000002},null,2.4,null,null,0.2]
[null,null,"Tournesol",89,0.56000000000000005,178,93,{"$f":"K71*(D71/100)","v":6.5860000000000003},{"$f":"N71*(D71/100)","v":2.1360000000000001},null,7.4,null,null,2.4]
[null,null,"Tournesol décortiqué",null,0.66,219,115,7.8,2.5]
[null,null,"Triticale",87,1.01,63,84,{"$f":"K73*(D73/100)","v":2.61},{"$f":"N73*(D73/100)","v":0.435},null,3,null,null,0.5]
[null,null,"Urée",98,0,1443,0,{"$f":"K74*(D74/100)","v":0},{"$f":"N74*(D74/100)","v":0},null,0,null,null,0]
[null,null,"Vesce",89,1.02,161,90,{"$f":"K75*(D75/100)","v":3.3819999999999997},{"$f":"N75*(D75/100)","v":0.89},null,3.8,null,null,1]

{"sheet":"CMV","index":7,"n_rows":42,"n_cols":24,"rows_kept":42,"cut":false,"hidden":false,"merged":[[15,2,15,11],[7,2,7,4],[6,2,6,4],[10,1,10,9],[7,6,7,9],[6,6,6,9],[13,6,13,7],[13,8,13,9],[11,6,11,9],[12,6,12,7],[12,8,12,9],[5,16,5,17],[3,8,3,17],[1,1,1,17],[0,1,0,17],[5,1,5,11],[2,1,2,7]]}
[null,"ALIM'ovins(v. 5.1) "]
[null,"Rationnement des ovins"]
[]
[null,null,null,null,null,null,null,null,"Ration"]
[]
[null,"Choisir le C.M.V. ayant le rapport \"Ca / P\" le plus approchant du déficit",null,null,null,null,null,null,null,null,null,null,null,null,null,"Pabs","   Caabs"]
[null,null,"1 Cliquez sur les flèches pour choisir le CMV",null,null,null,"Ca / P ration (avant correction)",null,null,null,null,"C.M.V. choisi",null,null,"100 % des A.A.R.",null,null,null,null,null,{"$f":"ANIMAL!H16","v":""},{"$f":"ANIMAL!I16","v":""}]
[null,"Type",null,null,null,null,{"$f":"IF(L24=TRUE,\"Un CMV n'est pas nécessaire\",IF(L14=\"\",\"\",IF(L12<0.2,\"Utilisez un CMV pauvre en P\",CONCATENATE(\"Utilisez un CMV avec \",INT(1.63*(L14/L12)),\" fois plus de Ca que de P\"))))","v":""},null,null,null,null,{"$f":"CONCATENATE(\"C.M.V.\",C8)","v":"C.M.V."},null,null,"Avant correction",null,null,null,null,null,{"$f":"IF(RATION!I24=\"\",RATION!I16,RATION!I16+RATION!I24)","v":""},{"$f":"IF(RATION!J24=\"\",RATION!J16,RATION!J16+RATION!J24)","v":""}]
[]
[null,null,null,null,null,null,null,null,null,null,null,null,null,null,null,null,null,null,null,0,{"$f":"U8/U7","v":{"$error":"#VALUE!"}},{"$f":"V8/V7","v":{"$error":"#VALUE!"}},0]
[null,"                       2  Saisir la quantité de CMV choisie  ou accepter la quantité proposée",null,null,null,null,null,null,null,null,null,"Déficit Pabs",null,null,null,{"$f":"IF(L12=\"\",\"\",U10)","v":""},null,{"$f":"IF(L14=\"\",\"\",V10)","v":""},null,1,1,1,1]
[null,null,null,"g.",null,null,"Valeurs alimentaires / kg brut",null,null,null,null,{"$f":"IF(ANIMAL!C8=\"\",\"\",IF(SUM(RATION!I24,RATION!I16)-RATION!I8>=0,0,-(SUM(RATION!I24,RATION!I16)-RATION!I8)))","v":""},null,null,"100 % des A.A.R."]
[null,null,null,null,null,null,"Pabs",null,"Caabs",null,null,"Déficit Caabs",null,null,null,null,null,null,null,{"$f":"IF(C8=\"\",0,(C12/1000)*G14)","v":0},{"$f":"T13+U8","v":{"$error":"#VALUE!"}},0,{"$f":"U13/U7","v":{"$error":"#VALUE!"}},{"$f":"U14/V7","v":{"$error":"#VALUE!"}}]
[null,"Ca / P",{"$f":"IF(C8=\"\",\"\",IF(VLOOKUP(C8,C20:H40,4)>10,\"ns\",VLOOKUP(C8,C20:H40,4)))","v":""},null,{"$f":"IF(C8=\"\",\"\",G42)","v":""},null,{"$f":"IF(C8=\"\",\"\",VLOOKUP(C8,C20:H40,5))","v":""},null,{"$f":"IF(C8=\"\",\"\",VLOOKUP(C8,C20:H40,6))","v":""},null,null,{"$f":"IF(ANIMAL!C8=\"\",\"\",IF(SUM(RATION!J24,RATION!J16)-RATION!J8>=0,0,-(SUM(RATION!J24,RATION!J16)-RATION!J8)))","v":""},null,null,"Après correction",null,null,null,null,{"$f":"IF(C8=\"\",0,(C12/1000)*I14)","v":0},{"$f":"T14+V8","v":{"$error":"#VALUE!"}},1,1,1]
[]
[null,null,{"$f":"IF(C8=\"\",\"\",IF(E14<10,\"Un CMV n'est pas nécessaire     -    Cliquez sur Valider sans rien saisir\",\"\"))","v":""},null,null,null,null,null,null,null,null,null,null,null,null,{"$f":"IF(L12=\"\",\"\",W13)","v":""},null,{"$f":"IF(L14=\"\",\"\",X13)","v":""}]
[]
[]
[]
[null,null," 0 - 27 ",null,null,{"$f":"J20/I20","v":2700},0.1,{"$f":"J20*0.4","v":108},0.1,270]
[null,null," 10 - 20",null,null,2,{"$f":"I21*0.65","v":65},80,100,200]
[null,null," 10 - 6",null,null,0.6,65,24,100,60]
[null,null," 12 - 12",null,null,1,78,48,120,120]
[null,null," 2 - 28",null,null,14,13,112,20,280,null,{"$f":"AND(L12<0.2,L14<0.2)","v":false}]
[null,null," 3 - 27",null,null,9,19.5,108,30,270]
[null,null," 4 - 21",null,null,5.25,26,84,40,210]
[null,null," 5 - 20",null,null,4,32.5,80,50,200]
[null,null," 5 - 22",null,null,4.4000000000000004,32.5,88,50,220]
[null,null," 5 - 25",null,null,5,32.5,100,50,250]
[null,null," 6 - 18",null,null,3,39,72,60,180]
[null,null," 6 - 6",null,null,1,39,24,60,60]
[null,null," 7 - 21",null,null,3,45.5,84,70,210]
[null,null," 7 - 23",null,null,3.2857142857142856,45.5,92,70,230,null," "]
[null,null," 8 - 12 ",null,null,1.5,52,48,80,120]
[null,null," 8 - 16 ",null,null,2,52,64,80,160]
[null,null," 8 - 18",null,null,2.25,52,72,80,180]
[null,null," 8 - 24",null,null,3,52,96,80,240]
[null,null," 9 - 14",null,null,1.5555555555555556,58.5,56,90,140]
[null,null," 9 - 27",null,null,3,58.5,108,90,270]
[null,null,"CaCO3",null,null,{"$error":"#DIV/0!"},0,160,0,400]
[]
[null,null,null,null,{"$f":"IF(L14=0,ABS(L12)/((G14+1.01)/1000),ABS(L14)/(I14/1000))","v":{"$error":"#VALUE!"}},null,{"$f":"ROUND(E42/5,0)*5","v":{"$error":"#VALUE!"}}]

{"sheet":"BILAN","index":8,"n_rows":70,"n_cols":18,"rows_kept":70,"cut":false,"hidden":false,"merged":[[0,1,0,18],[1,1,1,18],[9,2,10,3],[17,10,18,11],[17,12,18,12],[17,16,18,16],[17,17,18,17],[14,10,15,11],[14,12,15,12],[14,16,15,16],[14,17,15,17],[17,2,18,8],[3,8,3,16],[6,9,10,12],[6,13,8,17],[9,15,10,16],[20,16,21,17],[14,2,15,8],[31,2,31,11],[22,16,23,17],[22,12,23,12],[22,6,23,6],[22,2,23,4],[25,2,25,3],[22,7,23,9],[29,2,29,3],[27,2,27,3],[6,2,7,3],[9,6,10,7],[6,6,7,7],[5,9,5,16],[13,2,13,12],[13,15,13,18]]}
[null,"ALIM'ovins(v. 5.1) "]
[null,"Rationnement des ovins "]
[]
[null,null,null,null,null,null,null,null,"Bilan alimentaire"]
[]
[]
[null,null,"Saisir l'effectif d'animaux du lot",null,null,null,null,null,null,{"$f":"ANIMAL!E11","v":"               "},null,null,null,"Cout de concentré (€ / animal / jour)      "]
[null,null,null,null,null,""]
[]
[null,null,"Saisir la durée  d'alimentation  (en jours)",null,null,null,null,null,null,null,null,null,null,null,null,{"$f":"IF(G7=\"\",\"\",(M32/G7)/G10)","v":""}]
[null,null,null,null,null,""]
[]
[]
[null,null,"QUANTITE DE FOURRAGE ",null,null,null,null,null,null,null,null,null,null,null,null,"Pour 1 tonne de ration complète"]
[null,null,{"$f":"IF(FOURRAGE!C9=\"\",\"\",FOURRAGE!E9)","v":""},null,null,null,null,null,null,null,{"$f":"IF(C15=\"\",\"\",(G7*G10*FOURRAGE!L10)/1000)","v":""},null,"tonnes (brut)",null,null,null,{"$f":"IF(K15=\"\",\"\",IF(K15=0,0,K15/(SUM($K$15,$K$18,$H$26,$H$28,$H$30))*1000))","v":""},"kg"]
[]
[]
[null,null,{"$f":"IF(FOURRAGE!C23=\"\",\"\",FOURRAGE!E23)","v":""},null,null,null,null,null,null,null,{"$f":"IF(C18=\"\",\"\",(G7*G10*FOURRAGE!L24)/1000)","v":""},null,"tonnes (brut)",null,null,null,{"$f":"IF(K18=\"\",\"\",IF(K18=0,0,K18/(SUM($K$15,$K$18,$H$26,$H$28,$H$30))*1000))","v":""},"kg"]
[]
[]
[null,null,null,null,null,null,null,null,null,null,null,null,null,null,null,null,"Pourcentage de concentré"]
[]
[null,null,"COUT DE CONCENTRE",null,null,null,"kg / jour","Besoins pour la période",null,null,"Coût",null,"Cout total",null,null,null,{"$f":"SUM(Q26,Q28,Q30)/1000","v":0}]
[null,null,null,null,null,null,null,null,null,null,"    unitaire"]
[]
[null,null,{"$f":"IF(CONCENTRE!C10=\"\",\"\",CONCENTRE!C10)","v":""},null,null,null,{"$f":"IF(CONCENTRE!K9=\"\",\"\",CONCENTRE!K9)","v":""},{"$f":"IF(G26=\"\",\"\",(G26*$G$10*$G$7)/1000)","v":""},"tonnes",null,null," / t",{"$f":"IF(G26=\"\",\"\",K26*H26)","v":""},null,null,null,{"$f":"IF(K26=0,0,IF(M26=\"\",0,H26/(SUM($K$15,$K$18,$H$26,$H$28,$H$30))*1000))","v":0},"kg"]
[]
[null,null,{"$f":"IF(CONCENTRE!C17=\"\",\"\",CONCENTRE!C17)","v":""},null,null,null,{"$f":"IF(CONCENTRE!K16=\"\",\"\",CONCENTRE!K16)","v":""},{"$f":"IF(G28=\"\",\"\",(G28*$G$10*$G$7)/1000)","v":""},"tonnes",null,null," / t",{"$f":"IF(G28=\"\",\"\",K28*H28)","v":""},null,null,null,{"$f":"IF(K28=0,0,IF(M28=\"\",0,H28/(SUM($K$15,$K$18,$H$26,$H$28,$H$30))*1000))","v":0},"kg"]
[]
[null,null,{"$f":"IF(CMV!C8=\"\",\"\",CMV!C8)","v":""},null,null,null,{"$f":"IF(CMV!C12=\"\",\"\",CMV!C12/1000)","v":""},{"$f":"IF(G30=\"\",\"\",(G30*$G$10*$G$7)/1000)","v":""},"tonnes",null,null," / t",{"$f":"IF(G30=\"\",\"\",K30*H30)","v":""},null,null,null,{"$f":"IF(K30=0,0,IF(M30=\"\",0,H30/(SUM($K$15,$K$18,$H$26,$H$28,$H$30))*1000))","v":0},"kg"]
[]
[null,null,"COUT TOTAL DE CONCENTRE (en € pour le lot et pour la période)",null,null,null,null,null,null,null,null,null,{"$f":"IF($G$7=\"\",\"\",SUM(M26,M28,M30))","v":""},null,null,null,{"$f":"SUM(Q30,Q28,Q26,Q18,Q15)","v":0},"kg"]
[]
[]
[]
[]
[null,null,null,null,{"$f":"Q15","v":""}]
[]
[]
[null,1,"Janvier",2010]
[null,2,"Février",2011]
[null,3,"Mars",2012]
[null,4,"Avril",2013]
[null,5,"Mai",2014]
[null,6,"Juin",2015]
[null,7,"Juillet",2016]
[null,8,"Août"]
[null,9,"Septembre"]
[null,10,"Octobre"]
[null,11,"Novembre"]
[null,12,"Décembre"]
[null,13]
[null,14]
[null,15]
[null,16]
[null,17]
[null,18]
[null,19]
[null,20]
[null,21]
[null,22]
[null,23]
[null,24]
[null,25]
[null,26]
[null,27]
[null,28]
[null,29]
[null,30]
[null,31]

{"sheet":"MELANGE","index":9,"n_rows":31,"n_cols":9,"rows_kept":31,"cut":false,"hidden":false,"merged":[[0,1,0,10],[5,1,5,9],[19,4,20,4],[8,5,9,5],[19,7,20,7],[8,8,9,8],[15,1,16,9],[1,1,1,9],[4,1,4,9],[21,7,22,7],[21,4,22,4],[8,4,9,4],[8,7,9,7],[7,1,8,3]]}
[null,"ALIM'ovins(v. 5.0) "]
[null,"Rationnement des bovins allaitants"]
[]
[]
[null,"CALCUL DE LA COMPOSITION D'UN MELANGE DE 2 CONCENTRES"]
[null,"Système de 2 équations et 2 inconnues (x et y)"]
[]
[null,{"$f":"IF(E9=\"\",\"1 Mélange n'est pas nécessaire !\",IF(H9<0,\"1 Mélange n'est pas nécessaire !                   Cliquez sur Retour\",\"\"))","v":"1 Mélange n'est pas nécessaire !"},null,null,{"$f":"IF(CONCENTRE!C10=\"\",\"\",CONCENTRE!C10)","v":""},"x"," + ",{"$f":"IF(CONCENTRE!C17=\"\",\"\",CONCENTRE!C17)","v":""},"y"]
[null,null,null,null,{"$f":"E24","v":""},"kg",null,{"$f":"H24","v":""},"kg"]
[]
[null,null,"Déficit",null,{"$f":"IF(E9=\"\",\"\",E20/(E20+H20))","v":""},null,null,{"$f":"IF(H9=\"\",\"\",H20/(E20+H20))","v":""}]
[null,"UFL",{"$f":"IF(CONCENTRE!E10=\"\",\"\",-RATION!F18)","v":""}," = ",{"$f":"IF(CONCENTRE!C10=\"\",0.001,CONCENTRE!E10)","v":1E-3},"x"," + ",{"$f":"IF(CONCENTRE!C17=\"\",0.001,CONCENTRE!E17)","v":1E-3},"y"]
[]
[null,"PDIN",{"$f":"IF(CONCENTRE!F10=\"\",\"\",-RATION!G18)","v":""}," = ",{"$f":"IF(CONCENTRE!C10=\"\",0.001,CONCENTRE!F10)","v":1E-3},"x"," + ",{"$f":"IF(CONCENTRE!C17=\"\",0.001,CONCENTRE!F17)","v":1E-3},"y"]
[]
[null,{"$f":"IF(E9=\"\",\"VERIFIER vos concentrés, le mélange n'est pas adapté !\",IF(H9=\"\",\"VERIFIER vos concentrés, le mélange n'est pas adapté !\",\"\"))","v":"VERIFIER vos concentrés, le mélange n'est pas adapté !"}]
[]
[]
[]
[null,null,null,null,{"$f":"IF((C12-(H12*H20))/E12<0,\"\",IF(E12=0.001,0,IF(C12<=0.1,0,IF(C12=\"\",\"\",ROUND((C12-(H12*H20))/E12,1)))))","v":{"$error":"#VALUE!"}},null,null,{"$f":"IF((C14-(C12*E14)/E12)/(H14-((H12*E14)/E12))<0,0,IF(H12=0.001,0,IF(C14<=0.1,0,IF(C12=\"\",\"\",ROUND((C14-(C12*E14)/E12)/(H14-((H12*E14)/E12)),1)))))","v":{"$error":"#VALUE!"}}]
[]
[null,null,null,null,{"$f":"IF(E12=0.001,0,IF(C12<=0.1,0,IF(C12=\"\",\"\",(C12-(H12*H20))/E12)))","v":0},null,null,{"$f":"IF(H12=0.001,0,IF(C14<=0.1,0,IF(C12=\"\",\"\",(C14-(C12*E14)/E12)/(H14-((H12*E14)/E12)))))","v":0}]
[]
[null,null,null,null,{"$f":"IF(E22<=0,\"\",IF(H22>0,ROUND(E22,1),ROUND(C12/E12,1)))","v":""},null,null,{"$f":"IF(H22<=0,\"\",IF(E22>0,ROUND(H20,1),ROUND(C12/H12,1)))","v":""}]
[]
[]
[null,null,"(C14-(C12*E14)/E12)/(H14-((H12*E14)/E12))))"]
[null,null,"(C12-(H12*H9))/E12)"]
[]
[null,null,"SI(E12=0,001;0;SI(C12<=0,1;0;SI(C12=\"\";\"\";(C12-(H12*H9))/E12)))"]
[null,null,"SI(H12=0,001;0;SI(C14<=0,1;0;SI(C12=\"\";\"\";(C14-(C12*E14)/E12)/(H14-((H12*E14)/E12)))))"]

{"sheet":"RATION","index":10,"n_rows":32,"n_cols":26,"rows_kept":32,"cut":false,"hidden":false,"merged":[[0,1,0,17],[31,0,32,3],[13,1,14,1],[13,2,14,2],[25,6,26,7],[25,5,26,5],[31,4,31,9],[17,1,17,3],[30,2,30,3],[21,2,22,2],[21,1,22,1],[19,1,20,1],[19,2,20,2],[25,3,26,3],[25,1,26,1],[22,11,22,17],[11,2,12,2],[11,1,12,1],[1,1,1,17],[13,14,13,15],[13,11,14,13],[7,1,7,3],[9,3,9,9],[9,1,10,1],[5,4,5,9],[5,1,6,3],[9,2,10,2],[15,11,16,13],[18,11,19,13],[3,5,3,17],[5,11,5,17],[6,11,6,17]]}
[null,"ALIM'ovins(v. 5.1) "]
[null,"Rationnement des ovins"]
[]
[null,null,null,null,null,"Ration"]
[]
[null,"Catégorie",null,null,"Apports Alimentaires Recommandés",null,null,null,null,null,null,"REPARTITION DES APPORTS",null,null,null,null,null,null,null,"UFL","PDIN","PDIE","P","Ca"]
[null,null,null,null,"UEM","UFL","PDIN","PDIE","Pabs","Caabs",null,"en % des besoins alimentaires",null,null,null,null,null,null,null,{"$f":"F29/F8","v":{"$error":"#VALUE!"}},{"$f":"G29/G8","v":{"$error":"#VALUE!"}},{"$f":"H29/H8","v":{"$error":"#VALUE!"}},{"$f":"I29/I8","v":{"$error":"#VALUE!"}},{"$f":"J29/J8","v":{"$error":"#VALUE!"}}]
[null,{"$f":"IF(ANIMAL!E11=\"\",\"\",ANIMAL!E11)","v":"               "},null,null,{"$f":"IF($B$8=\"\",\"\",ANIMAL!E16)","v":""},{"$f":"IF($B$8=\"\",\"\",ANIMAL!F16)","v":""},{"$f":"IF($B$8=\"\",\"\",ANIMAL!G16)","v":""},{"$f":"IF($B$8=\"\",\"\",ANIMAL!G16)","v":""},{"$f":"IF($B$8=\"\",\"\",ANIMAL!H16)","v":""},{"$f":"IF($B$8=\"\",\"\",ANIMAL!I16)","v":""},null,null,null,null,null,null,null,null,null,1,1,1,1,1]
[]
[null,"Quantité   kg","Aliments                                       (valeurs / kg MS)","Valeurs alimentaires"]
[null,null,null,"MS","UEM","UFL","PDIN","PDIE","Pabs","Caabs"]
[null,{"$f":"IF(FOURRAGE!L10=\"\",\"\",FOURRAGE!L10)","v":""},{"$f":"FOURRAGE!E9","v":"          "},{"$f":"FOURRAGE!E15","v":""},{"$f":"FOURRAGE!F15","v":""},{"$f":"FOURRAGE!G15","v":""},{"$f":"FOURRAGE!H15","v":""},{"$f":"FOURRAGE!I15","v":""},{"$f":"FOURRAGE!J15","v":""},{"$f":"FOURRAGE!L15","v":""}]
[null,null,null,{"$f":"IF(B12=\"\",\"\",B12*(D12/100))","v":""},{"$f":"IF($D$13=\"\",\"\",$D$13*E12)","v":""},"","","","","",null,null,{"$f":"F29/F8","v":{"$error":"#VALUE!"}},{"$f":"G29/G8","v":{"$error":"#VALUE!"}},null,{"$f":"H29/H8","v":{"$error":"#VALUE!"}},{"$f":"I29/I8","v":{"$error":"#VALUE!"}},{"$f":"J29/J8","v":{"$error":"#VALUE!"}}]
[null,{"$f":"IF(FOURRAGE!L24=\"\",\"\",FOURRAGE!L24)","v":""},{"$f":"FOURRAGE!E23","v":"          "},{"$f":"IF(C14=\"\",\"\",FOURRAGE!E29)","v":""},{"$f":"IF(C14=\"\",\"\",FOURRAGE!F29)","v":""},{"$f":"IF(C14=\"\",\"\",FOURRAGE!G29)","v":""},{"$f":"IF(C14=\"\",\"\",FOURRAGE!H29)","v":""},{"$f":"IF(C14=\"\",\"\",FOURRAGE!I29)","v":""},{"$f":"IF(C14=\"\",\"\",FOURRAGE!J29)","v":""},{"$f":"IF(C14=\"\",\"\",FOURRAGE!L29)","v":""},null,"Part  des fourrages et des concentrés dans la ration",null,null," MS",null,"   UFL","PDIN"]
[null,null,null,{"$f":"IF(B14=\"\",\"\",B14*(D14/100))","v":""},{"$f":"IF($D$15=\"\",\"\",$D$15*E14)","v":""},"","","","",""]
[null,{"$f":"IF(SUM(B12,B14)=0,\"\",SUM(B12,B14))","v":""},"Ration de base",{"$f":"IF(B16=\"\",\"\",SUM(D13,D15))","v":""},{"$f":"IF(B16=\"\",\"\",SUM(E13,E15))","v":""},{"$f":"IF(B16=\"\",\"\",SUM(F13,F15))","v":""},{"$f":"IF(B16=\"\",\"\",SUM(G13,G15))","v":""},{"$f":"IF(B16=\"\",\"\",SUM(H13,H15))","v":""},{"$f":"IF(B16=\"\",\"\",SUM(I13,I15))","v":""},{"$f":"IF(B16=\"\",\"\",SUM(J13,J15))","v":""},null,"Concentrés"]
[null,null,null,null,null,null,null,null,null,null,null,null,null,null,{"$f":"IF(G7=\"\",\"\",IF(V18=0,\"\",V18))","v":""}]
[null,"Différence",null,null,{"$f":"IF(E8=\"\",\"\",E16-E8)","v":""},"","","","","",null,null,null,null,null,null,null,null,null,"Fourrage 1",{"$f":"B12","v":""},{"$f":"SUM(U18,U19)/SUM(U18,U19,U20,U21,0.0001)","v":0},{"$f":"F13","v":""},{"$f":"SUM(W18,W19)/SUM(W18,W19,W20,W21,0.0001)","v":0},{"$f":"G13","v":""},{"$f":"SUM(Y18,Y19)/SUM(Y18,Y19,Y20,Y21,0.0001)","v":0}]
[null,null,null,null,null,null,null,null,null,null,null,"Fourrages",null,null,{"$f":"IF(V19=0,\"\",V19)","v":""},null,null,null,null,"Fourrage 2",{"$f":"B14","v":""},{"$f":"SUM(U20,U21)/SUM(U18,U19,U20,U21,0.0001)","v":0},{"$f":"F15","v":""},{"$f":"SUM(W20,W21)/SUM(W18,W19,W20,W21,0.0001)","v":0},{"$f":"H15","v":""},{"$f":"SUM(Y20,Y21)/SUM(Y18,Y19,Y20,Y21,0.0001)","v":0}]
[null,{"$f":"IF(CONCENTRE!K9=\"\",\"\",CONCENTRE!K9)","v":""},{"$f":"IF(B20=\"\",\"\",CONCENTRE!C10)","v":""},null,null,{"$f":"IF(C20=\"\",\"\",CONCENTRE!E10)","v":""},{"$f":"IF(C20=\"\",\"\",CONCENTRE!F10)","v":""},{"$f":"IF(C20=\"\",\"\",CONCENTRE!G10)","v":""},{"$f":"IF(C20=\"\",\"\",CONCENTRE!H10)","v":""},{"$f":"IF(C20=\"\",\"\",CONCENTRE!I10)","v":""},null,null,null,null,null,null,null,null,null,"Concentré 1",{"$f":"B20","v":""},null,{"$f":"F21","v":""},null,{"$f":"G21","v":""}]
[null,null,null,null,null,{"$f":"IF(B20=\"\",\"\",$B$20*F20)","v":""},{"$f":"IF(B20=\"\",\"\",$B$20*G20)","v":""},{"$f":"IF(B20=\"\",\"\",$B$20*H20)","v":""},{"$f":"IF(B20=\"\",\"\",$B$20*I20)","v":""},{"$f":"IF(B20=\"\",\"\",$B$20*J20)","v":""},null,null,null,null,null,null,null,null,null,"Concentré 2",{"$f":"B22","v":""},null,{"$f":"F23","v":""},null,{"$f":"G23","v":""}]
[null,{"$f":"IF(CONCENTRE!K16=\"\",\"\",CONCENTRE!K16)","v":""},{"$f":"IF(B22=\"\",\"\",CONCENTRE!C17)","v":""},null,null,{"$f":"IF(C22=\"\",\"\",CONCENTRE!E17)","v":""},{"$f":"IF(C22=\"\",\"\",CONCENTRE!F17)","v":""},{"$f":"IF(C22=\"\",\"\",CONCENTRE!G17)","v":""},{"$f":"IF(C22=\"\",\"\",CONCENTRE!H17)","v":""},{"$f":"IF(C22=\"\",\"\",CONCENTRE!I17)","v":""}]
[null,null,null,null,null,{"$f":"IF(B22=\"\",\"\",$B$22*F22)","v":""},{"$f":"IF(B22=\"\",\"\",$B$22*G22)","v":""},{"$f":"IF(B22=\"\",\"\",$B$22*H22)","v":""},{"$f":"IF(B22=\"\",\"\",$B$22*I22)","v":""},{"$f":"IF(B22=\"\",\"\",$B$22*J22)","v":""},null,"REPARTITION DES ALIMENTS"]
[null,{"$f":"IF(SUM(B20,B22)=0,\"\",SUM(B20,B22))","v":""},"Concentrés",null,null,{"$f":"IF(B24=\"\",\"\",SUM(F21,F23))","v":""},{"$f":"IF(B24=\"\",\"\",SUM(G21,G23))","v":""},{"$f":"IF(B24=\"\",\"\",SUM(H21,H23))","v":""},{"$f":"IF(B24=\"\",\"\",SUM(I21,I23))","v":""},{"$f":"IF(B24=\"\",\"\",SUM(J21,J23))","v":""}]
[]
[null,"RMIC =","  PDIN - PDIE",{"$f":"IF(D29=\"\",\"\",(G29-H29)/F29)","v":""}," *",{"$f":"IF(CMV!C8=\"\",\"\",(CMV!C12)/1000)","v":""},{"$f":"IF(F26=\"\",\"\",CMV!L8)","v":""},null,{"$f":"CMV!G14","v":""},{"$f":"CMV!I14","v":""}]
[null,null,"        UFL",null,null,null,null,null,{"$f":"IF(F26=\"\",\"\",I26*F26)","v":""},{"$f":"IF(F26=\"\",\"\",J26*F26)","v":""}]
[]
[null,{"$f":"IF(B16=\"\",\"\",SUM(B16,B24,F26))","v":""},"TOTAL RATION",{"$f":"D16","v":""},{"$f":"E16","v":""},{"$f":"IF(F18=\"\",\"\",SUM(F24,F16))","v":""},{"$f":"IF(G18=\"\",\"\",SUM(G24,G16))","v":""},{"$f":"IF(H18=\"\",\"\",SUM(H24,H16))","v":""},{"$f":"IF(I18=\"\",\"\",SUM(I24,I16,I27))","v":""},{"$f":"IF(J18=\"\",\"\",SUM(J24,J16,J27))","v":""}]
[]
[null,null,"Différence",null,{"$f":"IF(B16=\"\",\"\",E29-E8)","v":""},{"$f":"IF($B$16=\"\",\"\",F29-F8)","v":""},{"$f":"IF($B$16=\"\",\"\",G29-G8)","v":""},{"$f":"IF($B$16=\"\",\"\",H29-H8)","v":""},{"$f":"IF($B$16=\"\",\"\",I29-I8)","v":""},{"$f":"IF($B$16=\"\",\"\",J29-J8)","v":""}]
[" * RMIC < - 12 (Brebis allaitantes - agneaux simples)                         RMIC < - 6 (Brebis allaitantes - agneaux doubles)",null,null,null,{"$f":"IF(E31=\"\",\"\",IF(E31>0.01,\"ATTENTION ! La capacité d'ingestion est dépassée: REDUISEZ LES QUANTITES DE FOURRAGE\",\"\"))","v":""}]

{"sheet":"COUT","index":11,"n_rows":84,"n_cols":17,"rows_kept":84,"cut":false,"hidden":false,"merged":[[20,5,21,6],[20,9,21,10],[18,4,19,4],[14,1,15,1],[14,3,15,3],[18,1,19,1],[18,3,19,3],[16,3,17,3],[16,1,17,1],[16,4,17,4],[14,4,15,4],[14,2,15,2],[16,2,17,2],[18,2,19,2],[8,3,9,3],[4,1,4,14],[8,2,9,2],[6,2,7,3],[6,4,6,12],[1,1,1,17],[3,5,3,17],[0,1,0,17],[4,15,5,17],[12,1,13,1],[12,3,13,3],[6,1,7,1],[12,4,13,4],[8,4,9,4],[10,4,11,4],[10,1,11,1],[10,3,11,3],[10,2,11,2],[12,2,13,2],[5,14,8,14],[8,1,9,1]]}
[null,"ALIM'ovins(v. 5.1) "]
[null,"Rationnement des ovins"]
[]
[null,null,null,null,null,"Formulation d'aliment et coût"]
[null,"FORMULATION ET CALCUL DU COUT D'UN MELANGE FERMIER",null,null,null,null,null,null,null,null,null,null,null,null,null,"Répartition des matières premières"]
[null,"                     Cliquez dans la case \"Matières premières\" et choisissez dans la liste - Saisissez ensuite les quantités introduites dans le mélange",null,null,null,null,null,null,null,null,null,null,null,null,"Coût des matières premières                  (€ /tonne)"]
[null,"Quantités     kg","Matières premières",null,"Valeurs alimentaires"]
[null,null,null,null,"%","UFL","UFV","PDIN","PDIE","Pabs","Caabs","MAT","CB"]
[null,null,null,null,{"$f":"IF(B9=\"\",\"\",B9/$B$23)","v":""},{"$f":"IF(B9=\"\",\"\",IF(C9=\"Mes_concentrés\",VLOOKUP(D9,NOUVEAU!$R$22:$AA$38,3),VLOOKUP($D9,$D29:$K76,3)))","v":""},{"$f":"IF(B9=\"\",\"\",IF(C9=\"Mes_concentrés\",VLOOKUP(D9,NOUVEAU!$R$22:$AA$38,4),VLOOKUP($D9,$D29:$K76,4)))","v":""},{"$f":"IF(B9=\"\",\"\",IF(C9=\"Mes_concentrés\",VLOOKUP(D9,NOUVEAU!$R$22:$AA$38,5),VLOOKUP($D9,$D29:$K76,5)))","v":""},{"$f":"IF(B9=\"\",\"\",IF(C9=\"Mes_concentrés\",VLOOKUP(D9,NOUVEAU!$R$22:$AA$38,6),VLOOKUP($D9,$D29:$K76,6)))","v":""},{"$f":"IF(B9=\"\",\"\",IF(C9=\"Mes_concentrés\",VLOOKUP(D9,NOUVEAU!$R$22:$AA$38,7),VLOOKUP($D9,$D29:$K76,7)))","v":""},{"$f":"IF(B9=\"\",\"\",IF(C9=\"Mes_concentrés\",VLOOKUP(D9,NOUVEAU!$R$22:$AA$38,8),VLOOKUP($D9,$D29:$K76,8)))","v":""},{"$f":"IF(B9=\"\",\"\",IF(C9=\"Mes_concentrés\",VLOOKUP(D9,NOUVEAU!$R$22:$AC$38,9),VLOOKUP($D9,$D29:$M76,9)))","v":""},{"$f":"IF(B9=\"\",\"\",IF(C9=\"Mes_concentrés\",VLOOKUP(D9,NOUVEAU!$R$22:$AC$38,10),VLOOKUP($D9,$D29:$M76,10)))","v":""}]
[null,null,null,null,null,{"$f":"IF(B9=\"\",\"\",$E$9*F9)","v":""},{"$f":"IF(B9=\"\",\"\",$E$9*G9)","v":""},{"$f":"IF(B9=\"\",\"\",$E$9*H9)","v":""},{"$f":"IF(B9=\"\",\"\",$E$9*I9)","v":""},{"$f":"IF(B9=\"\",\"\",$E$9*J9)","v":""},{"$f":"IF(B9=\"\",\"\",$E$9*K9)","v":""},{"$f":"IF(B9=\"\",\"\",$E$9*L9)","v":""},{"$f":"IF(B9=\"\",\"\",$E$9*M9)","v":""}]
[null,null,null,null,{"$f":"IF(B9=\"\",\"\",B11/$B$23)","v":""},{"$f":"IF(B11=\"\",\"\",IF(C11=\"Mes_concentrés\",VLOOKUP(D11,NOUVEAU!$R$22:$AA$38,3),VLOOKUP($D11,$D29:$K76,3)))","v":""},{"$f":"IF(B11=\"\",\"\",IF(C11=\"Mes_concentrés\",VLOOKUP(D11,NOUVEAU!$R$22:$AA$38,4),VLOOKUP($D11,$D29:$K76,4)))","v":""},{"$f":"IF(B11=\"\",\"\",IF(C11=\"Mes_concentrés\",VLOOKUP(D11,NOUVEAU!$R$22:$AA$38,5),VLOOKUP($D11,$D29:$K76,5)))","v":""},{"$f":"IF(B11=\"\",\"\",IF(C11=\"Mes_concentrés\",VLOOKUP(D11,NOUVEAU!$R$22:$AA$38,6),VLOOKUP($D11,$D29:$K76,6)))","v":""},{"$f":"IF(B11=\"\",\"\",IF(C11=\"Mes_concentrés\",VLOOKUP(D11,NOUVEAU!$R$22:$AA$38,7),VLOOKUP($D11,$D29:$K76,7)))","v":""},{"$f":"IF(B11=\"\",\"\",IF(C11=\"Mes_concentrés\",VLOOKUP(D11,NOUVEAU!$R$22:$AA$38,8),VLOOKUP($D11,$D29:$K76,8)))","v":""},{"$f":"IF(B11=\"\",\"\",IF(C11=\"Mes_concentrés\",VLOOKUP(D11,NOUVEAU!$R$22:$AC$38,9),VLOOKUP($D11,$D29:$M76,9)))","v":""},{"$f":"IF(B11=\"\",\"\",IF(C11=\"Mes_concentrés\",VLOOKUP(D11,NOUVEAU!$R$22:$AC$38,10),VLOOKUP($D11,$D29:$M76,10)))","v":""}]
[null,null,null,null,null,{"$f":"IF(B11=\"\",\"\",E11*F11)","v":""},{"$f":"IF(B11=\"\",\"\",E11*G11)","v":""},{"$f":"IF(B11=\"\",\"\",E11*H11)","v":""},{"$f":"IF(B11=\"\",\"\",E11*I11)","v":""},{"$f":"IF(B11=\"\",\"\",E11*J11)","v":""},{"$f":"IF(B11=\"\",\"\",E11*K11)","v":""},{"$f":"IF(B11=\"\",\"\",E11*L11)","v":""},{"$f":"IF(B11=\"\",\"\",$E$11*M11)","v":""}]
[null,null,null,null,{"$f":"IF(B9=\"\",\"\",B13/$B$23)","v":""},{"$f":"IF(B13=\"\",\"\",IF(C13=\"Mes_concentrés\",VLOOKUP(D13,NOUVEAU!$R$22:$AA$38,3),VLOOKUP($D13,$D29:$K76,3)))","v":""},{"$f":"IF(B13=\"\",\"\",IF(C13=\"Mes_concentrés\",VLOOKUP(D13,NOUVEAU!$R$22:$AA$38,4),VLOOKUP($D13,$D29:$K76,4)))","v":""},{"$f":"IF(B13=\"\",\"\",IF(C13=\"Mes_concentrés\",VLOOKUP(D13,NOUVEAU!$R$22:$AA$38,5),VLOOKUP($D13,$D29:$K76,5)))","v":""},{"$f":"IF(B13=\"\",\"\",IF(C13=\"Mes_concentrés\",VLOOKUP(D13,NOUVEAU!$R$22:$AA$38,6),VLOOKUP($D13,$D29:$K76,6)))","v":""},{"$f":"IF(B13=\"\",\"\",IF(C13=\"Mes_concentrés\",VLOOKUP(D13,NOUVEAU!$R$22:$AA$38,7),VLOOKUP($D13,$D29:$K76,7)))","v":""},{"$f":"IF(B13=\"\",\"\",IF(C13=\"Mes_concentrés\",VLOOKUP(D13,NOUVEAU!$R$22:$AA$38,8),VLOOKUP($D13,$D29:$K76,8)))","v":""},{"$f":"IF(B13=\"\",\"\",IF(C13=\"Mes_concentrés\",VLOOKUP(D13,NOUVEAU!$R$22:$AC$38,9),VLOOKUP($D13,$D29:$M76,9)))","v":""},{"$f":"IF(B13=\"\",\"\",IF(C13=\"Mes_concentrés\",VLOOKUP(D13,NOUVEAU!$R$22:$AC$38,10),VLOOKUP($D13,$D29:$M76,10)))","v":""}]
[null,null,null,null,null,{"$f":"IF(B13=\"\",\"\",E13*F13)","v":""},{"$f":"IF(C13=\"\",\"\",E13*G13)","v":""},{"$f":"IF(B13=\"\",\"\",E13*H13)","v":""},{"$f":"IF(B13=\"\",\"\",E13*I13)","v":""},{"$f":"IF(B13=\"\",\"\",E13*J13)","v":""},{"$f":"IF(B13=\"\",\"\",E13*K13)","v":""},{"$f":"IF(B13=\"\",\"\",E13*L13)","v":""},{"$f":"IF(B13=\"\",\"\",$E$13*M13)","v":""}]
[null,null,null,null,{"$f":"IF(B9=\"\",\"\",B15/$B$23)","v":""},{"$f":"IF(B15=\"\",\"\",IF(C15=\"Mes_concentrés\",VLOOKUP(D15,NOUVEAU!$R$22:$AA$38,3),VLOOKUP($D15,$D29:$K76,3)))","v":""},{"$f":"IF(B15=\"\",\"\",IF(C15=\"Mes_concentrés\",VLOOKUP(D15,NOUVEAU!$R$22:$AA$38,4),VLOOKUP($D15,$D29:$K76,4)))","v":""},{"$f":"IF(B15=\"\",\"\",IF(C15=\"Mes_concentrés\",VLOOKUP(D15,NOUVEAU!$R$22:$AA$38,5),VLOOKUP($D15,$D29:$K76,5)))","v":""},{"$f":"IF(B15=\"\",\"\",IF(C15=\"Mes_concentrés\",VLOOKUP(D15,NOUVEAU!$R$22:$AA$38,6),VLOOKUP($D15,$D29:$K76,6)))","v":""},{"$f":"IF(B15=\"\",\"\",IF(C15=\"Mes_concentrés\",VLOOKUP(D15,NOUVEAU!$R$22:$AA$38,7),VLOOKUP($D15,$D29:$K76,7)))","v":""},{"$f":"IF(B15=\"\",\"\",IF(C15=\"Mes_concentrés\",VLOOKUP(D15,NOUVEAU!$R$22:$AA$38,8),VLOOKUP($D15,$D29:$K76,8)))","v":""},{"$f":"IF(B15=\"\",\"\",IF(C15=\"Mes_concentrés\",VLOOKUP(D15,NOUVEAU!$R$22:$AC$38,9),VLOOKUP($D15,$D29:$M76,9)))","v":""},{"$f":"IF(B15=\"\",\"\",IF(C15=\"Mes_concentrés\",VLOOKUP(D15,NOUVEAU!$R$22:$AC$38,10),VLOOKUP($D15,$D29:$M76,10)))","v":""}]
[null,null,null,null,null,{"$f":"IF(B15=\"\",\"\",E15*F15)","v":""},{"$f":"IF(B15=\"\",\"\",E15*G15)","v":""},{"$f":"IF(B15=\"\",\"\",E15*H15)","v":""},{"$f":"IF(B15=\"\",\"\",E15*I15)","v":""},{"$f":"IF(B15=\"\",\"\",E15*J15)","v":""},{"$f":"IF(B15=\"\",\"\",E15*K15)","v":""},{"$f":"IF(B15=\"\",\"\",E15*L15)","v":""},{"$f":"IF(B15=\"\",\"\",$E$15*M15)","v":""}]
[null,null,null,null,{"$f":"IF(B9=\"\",\"\",B17/$B$23)","v":""},{"$f":"IF(B17=\"\",\"\",IF(C17=\"Mes_concentrés\",VLOOKUP(D17,NOUVEAU!$R$22:$AA$38,3),VLOOKUP($D17,$D29:$K76,3)))","v":""},{"$f":"IF(B17=\"\",\"\",IF(C17=\"Mes_concentrés\",VLOOKUP(D17,NOUVEAU!$R$22:$AA$38,4),VLOOKUP($D17,$D29:$K76,4)))","v":""},{"$f":"IF(B17=\"\",\"\",IF(C17=\"Mes_concentrés\",VLOOKUP(D17,NOUVEAU!$R$22:$AA$38,5),VLOOKUP($D17,$D29:$K76,5)))","v":""},{"$f":"IF(B17=\"\",\"\",IF(C17=\"Mes_concentrés\",VLOOKUP(D17,NOUVEAU!$R$22:$AA$38,6),VLOOKUP($D17,$D29:$K76,6)))","v":""},{"$f":"IF(B17=\"\",\"\",IF(C17=\"Mes_concentrés\",VLOOKUP(D17,NOUVEAU!$R$22:$AA$38,7),VLOOKUP($D17,$D29:$K76,7)))","v":""},{"$f":"IF(B17=\"\",\"\",IF(C17=\"Mes_concentrés\",VLOOKUP(D17,NOUVEAU!$R$22:$AA$38,8),VLOOKUP($D17,$D29:$K76,8)))","v":""},{"$f":"IF(B17=\"\",\"\",IF(C17=\"Mes_concentrés\",VLOOKUP(D17,NOUVEAU!$R$22:$AC$38,9),VLOOKUP($D17,$D29:$M76,9)))","v":""},{"$f":"IF(B17=\"\",\"\",IF(C17=\"Mes_concentrés\",VLOOKUP(D17,NOUVEAU!$R$22:$AC$38,10),VLOOKUP($D17,$D29:$M76,10)))","v":""}]
[null,null,null,null,null,{"$f":"IF(B17=\"\",\"\",E17*F17)","v":""},{"$f":"IF(B17=\"\",\"\",E17*G17)","v":""},{"$f":"IF(B17=\"\",\"\",E17*H17)","v":""},{"$f":"IF(B17=\"\",\"\",E17*I17)","v":""},{"$f":"IF(B17=\"\",\"\",E17*J17)","v":""},{"$f":"IF(B17=\"\",\"\",E17*K17)","v":""},{"$f":"IF(B17=\"\",\"\",E17*L17)","v":""},{"$f":"IF(B17=\"\",\"\",$E$17*M17)","v":""}]
[null,null,null,null,{"$f":"IF(B9=\"\",\"\",B19/$B$23)","v":""},{"$f":"IF(B19=\"\",\"\",IF(C19=\"Mes_concentrés\",VLOOKUP(D19,NOUVEAU!$R$22:$AA$38,3),VLOOKUP($D19,$D29:$K76,3)))","v":""},{"$f":"IF(B19=\"\",\"\",IF(C19=\"Mes_concentrés\",VLOOKUP(D19,NOUVEAU!$R$22:$AA$38,4),VLOOKUP($D19,$D29:$K76,4)))","v":""},{"$f":"IF(B19=\"\",\"\",IF(C19=\"Mes_concentrés\",VLOOKUP(D19,NOUVEAU!$R$22:$AA$38,5),VLOOKUP($D19,$D29:$K76,5)))","v":""},{"$f":"IF(B19=\"\",\"\",IF(C19=\"Mes_concentrés\",VLOOKUP(D19,NOUVEAU!$R$22:$AA$38,6),VLOOKUP($D19,$D29:$K76,6)))","v":""},{"$f":"IF(B19=\"\",\"\",IF(C19=\"Mes_concentrés\",VLOOKUP(D19,NOUVEAU!$R$22:$AA$38,7),VLOOKUP($D19,$D29:$K76,7)))","v":""},{"$f":"IF(B19=\"\",\"\",IF(C19=\"Mes_concentrés\",VLOOKUP(D19,NOUVEAU!$R$22:$AA$38,8),VLOOKUP($D19,$D29:$K76,8)))","v":""},{"$f":"IF(B19=\"\",\"\",IF(C19=\"Mes_concentrés\",VLOOKUP(D19,NOUVEAU!$R$22:$AC$38,9),VLOOKUP($D19,$D29:$M76,9)))","v":""},{"$f":"IF(B19=\"\",\"\",IF(C19=\"Mes_concentrés\",VLOOKUP(D19,NOUVEAU!$R$22:$AC$38,10),VLOOKUP($D19,$D29:$M76,10)))","v":""}]
[null,null,null,null,null,{"$f":"IF(B19=\"\",\"\",E19*F19)","v":""},{"$f":"IF(B19=\"\",\"\",E19*G19)","v":""},{"$f":"IF(B19=\"\",\"\",E19*H19)","v":""},{"$f":"IF(B19=\"\",\"\",E19*I19)","v":""},{"$f":"IF(B19=\"\",\"\",E19*J19)","v":""},{"$f":"IF(B19=\"\",\"\",E19*K19)","v":""},{"$f":"IF(B19=\"\",\"\",E19*L19)","v":""},{"$f":"IF(B19=\"\",\"\",$E$19*M19)","v":""}]
[null,null,null,null,null,{"$f":"CONCATENATE(ROUND(H23/F23,0),\" PDI / UFL\")","v":{"$error":"#VALUE!"}},null,null,null,{"$f":"CONCATENATE(\"Ca / P = \",ROUND(K23/J23,1))","v":{"$error":"#VALUE!"}}]
[null,null,null,null,null,null,null,null,null,null,null,null,null,null,"COUT € / kg"]
[null,{"$f":"SUM(B9:B20)","v":0},"kg","Mon aliment",{"$f":"IF(B9=\"\",\"\",SUM(E9:E20))","v":""},{"$f":"IF(F10=\"\",\"\",SUM(F10,F12,F14,F16,F18,F20))","v":""},"","","","","",{"$f":"IF(L10=\"\",\"\",SUM(L10,L12,L14,L16,L18,L20))","v":""},"",null,{"$f":"IF(B9=\"\",\"\",((O10*B9)+(O12*B11)+(O14*B13)+(O16*B15)+(O18*B17)+(O20*B19))/(B23*1000))","v":""}]
[null,null,null,"Les valeurs alimentaires sont reportées dans la liste des aliments \"Mon aliment\""]
[]
[]
[]
[null,null,null,"Catégorie","C","U.F.L.","U.F.V.","P.D.I.N.","P.D.I.E.","Pabs","Caabs","MAT","CB"]
[null,null,null,"Avoine",null,0.77,0.71,61,61,2.7,0.7,11.1,13.8,null,null,null,"Avoine"]
[null,null,null,"Bicarbonate de Na",null,0,0,0,0,0,0,0,0,null,null,null,"Blé"]
[null,"Céréale",null,"Blé",null,1.02,1.02,70,89,2.6,0.4,12.1,2.6,null,null,null,"Maïs grain"]
[null,"Tourteau",null,"Carbonate de Ca",null,0,0,0,0,0,150,0,0,null,null,null,"Orge"]
[null,"Graines",null,"CMV 0 - 27",null,0,0,0,0,0,108,0,0,null,null,null,"Sarrazin"]
[null,"Divers",null,"CMV 10 - 20",null,0,0,0,0,65,80,0,0,null,null,null,"Seigle"]
[null,"Minéraux",null,"CMV 10 - 6",null,0,0,0,0,65,24,0,0,null,null,null,"Sorgho"]
[null,"Mes_concentrés",null,"CMV 12 - 12",null,0,0,0,0,78,48,0,0,null,null,null,"Triticale"]
[null,"Fibres",null,"CMV 12 - 12",null,0,0,0,0,78,48,0,0]
[null,null,null,"CMV 2 - 28",null,0,0,0,0,13,112,0,0,null,null,null,"Tourteau d'arachide"]
[null,null,null,"CMV 3 - 27",null,0,0,0,0,20,108,0,0,null,null,null,"Tourteau de colza"]
[null,null,null,"CMV 4 - 21",null,0,0,0,0,26,84,0,0,null,null,null,"Tourteau de coton"]
[null,null,null,"CMV 5 - 20",null,0,0,0,0,32,80,0,0,null,null,null,"Tourteau de lin"]
[null,null,null,"CMV 5 - 25",null,0,0,0,0,32,100,0,0,null,null,null,"Tourteau de soja "]
[null,null,null,"CMV 6 - 6",null,0,0,0,0,39,24,0,0,null,null,null,"Tourteau de tournesol"]
[null,null,null,"CMV 7 - 21",null,0,0,0,0,15,84,0,0]
[null,null,null,"CMV 8 - 12 ",null,0,0,0,0,52,48,0,0,null,null,null,"Féverole"]
[null,null,null,"CMV 8 - 16 ",null,0,0,0,0,52,64,0,0,null,null,null,"Graines de colza"]
[null,null,null,"CMV 8 - 24",null,0,0,0,0,52,96,0,0,null,null,null,"Graines de coton"]
[null,null,null,"CMV 9 - 14",null,0,0,0,0,58,56,0,0,null,null,null,"Graines de lin"]
[null,null,null,"Drêches de blé",null,0.76,0.68,178,157,4.9000000000000004,1.3,31,6,null,null,null,"Graines de soja"]
[null,null,null,"Drêches de brasserie",null,0.75,0.67,180,160,5,1,31.6,6.1,null,null,null,"Graines de tournesol"]
[null,null,null,"Féverole",null,1.03,1.03,170,97,4.0999999999999996,0.9,31.1,9.6,null,null,null,"Lupin"]
[null,null,null,"Foin (prairies)",null,0.6,0.5,55,65,2,1.5,10,33,null,null,null,"Pois"]
[null,null,null,"Graines de colza",null,1.68,1.68,12,61,5.3,2.8,20.7,8.9,null,null,null,"Vesce"]
[null,null,null,"Graines de coton",null,0.94,0.85,131,77,5.0999999999999996,1,23.4,25.9]
[null,null,null,"Huile de colza",null,2.73,2.78,0,0,0,0,0,0,null,null,null,"Bicarbonate de Na"]
[null,null,null,"Lupin",null,1.18,1.18,213,106,3.2,2.1,38.5,12.8,null,null,null,"Drêches de blé"]
[null,null,null,"Luzerne (foin)",null,0.6,0.5,100,80,1.3,3.8,17,36,null,null,null,"Drêches de brasserie"]
[null,null,null,"Luzerne déshydratée",null,0.62,0.54,103,91,1.9,6.5,17.5,29.5,null,null,null,"Huile de colza"]
[null,null,null,"Maïs grain",null,1.06,1.06,64,84,2.2000000000000002,0.3,9.4,2.5,null,null,null,"Lactosérum"]
[null,null,null,"Mélasse",null,0.75,0.75,63,54,0.2,0.5,14.5,0,null,null,null,"Luzerne deshydratée"]
[null,null,null,"Orge",null,0.95,0.93,69,87,3,0.5,11.6,5.2,null,null,null,"Mélasse"]
[null,null,null,"Paille de céréales",null,0.4,0.35,25,45,0.5,1,3.5,42,null,null,null,"Poudre de lait écrémé"]
[null,null,null,"Pois",null,1.04,1.05,130,83,3.4,0.7,23.9,6,null,null,null,"Pulpe de betterave"]
[null,null,null,"Poudre de lait écrémé",null,1.1499999999999999,1.17,196,75,9.6999999999999993,11.7,36,0,0]
[null,null,null,"Pulpe de betterave",null,0.89,0.87,59,97,0.9,3,9.1,19.399999999999999,100,null,null,"Carbonate de Ca"]
[null,null,null,"Sarrazin",null,0.81,0.76,77,82,2.6,0.5,13.1,11.6,100,null,null,"CMV 0 - 27"]
[null,null,null,"Seigle",null,1.03,1.03,59,85,2.6,0.7,10.3,2.2000000000000002,120,null,null,"CMV 10 - 20"]
[null,null,null,"Sorgho",null,1.05,1.06,67,87,2.4,0.2,109,2.7,120,null,null,"CMV 10 - 6"]
[null,null,null,"Tourteau d'arachide",null,1,0.97,347,215,4.0999999999999996,1.2,54.6,7.6,40,null,null,"CMV 12 - 12"]
[null,null,null,"Tourteau de colza",null,0.85,0.8,219,138,9.1999999999999993,5.2,35,13.9,50,null,null,"CMV 2 - 28"]
[null,null,null,"Tourteau de lin",null,0.88,0.84,227,179,6,2.8,35.9,11,50,null,null,"CMV 3 - 27"]
[null,null,null,"Tourteau de soja",null,1.06,1.05,331,229,5,2.1,51.6,6.8,60,null,null,"CMV 4 - 21"]
[null,null,null,"Tourteau de tournesol",null,0.56000000000000005,0.46,178,93,7.4,2.4,37.299999999999997,23.6,70,null,null,"CMV 5 - 20"]
[null,null,null,"Triticale",null,1.01,1.02,63,84,3,0.5,11,2.7,80,null,null,"CMV 5 - 25"]
[null,null,null,"Urée",null,0,0,1443,0,0,0,0,0,80,null,null,"CMV 6 - 6"]
[null,null,null,"Vesce",null,1.02,1.01,161,90,3.8,1,29.6,7.4,80,null,null,"CMV 7 - 21"]
[null,null,null,null,null,null,null,null,null,null,null,null,null,90,null,null,"CMV 8 - 12 "]
[null,null,null,null,null,null,null,null,null,null,null,null,null,0,null,null,"CMV 8 - 16 "]
[null,null,null,null,null,null,null,null,null,null,null,null,null,null,null,null,"CMV 8 - 24"]
[null,null,null,null,null,null,null,null,null,null,null,null,null,null,null,null,"CMV 9 - 14"]
[]
[null,null,null,null,null,null,null,null,null,null,null,null,null,null,null,null,"Paille de céréales"]
[null,null,null,null,null,null,null,null,null,null,null,null,null,null,null,null,"Luzerne (foin)"]
[null,null,null,null,null,null,null,null,null,null,null,null,null,null,null,null,"Foin (prairies)"]

{"sheet":"IMPRIMER","index":12,"n_rows":40,"n_cols":10,"rows_kept":40,"cut":false,"hidden":false,"merged":[[1,6,1,9],[31,2,31,3],[32,0,33,3],[32,4,32,9],[22,1,23,1],[22,2,23,2],[26,1,27,1],[26,3,27,3],[26,5,27,5],[26,6,27,7],[20,2,21,2],[14,1,15,1],[14,2,15,2],[20,1,21,1],[2,1,2,9],[12,1,13,1],[12,2,13,2],[18,1,18,3],[6,1,7,3],[6,4,6,9],[8,1,8,3],[10,1,11,1],[10,2,11,2],[10,3,10,9]]}
[]
[null,"ALIM'ovins (v. 5.1)",null,null,null,"Nom:"]
[null,"Rationnement des ovins allaitants"]
[]
[]
[]
[null,"Catégorie",null,null,"Apports Alimentaires Recommandés"]
[null,null,null,null,"UEM","UFL","PDIN","PDIE","Pabs","Caabs"]
[null,{"$f":"IF(ANIMAL!E11=\"\",\"\",ANIMAL!E11)","v":"               "},null,null,{"$f":"IF($B$9=\"\",\"\",ANIMAL!E16)","v":""},{"$f":"IF($B$9=\"\",\"\",ANIMAL!F16)","v":""},{"$f":"IF($B$9=\"\",\"\",ANIMAL!G16)","v":""},{"$f":"IF($B$9=\"\",\"\",ANIMAL!G16)","v":""},{"$f":"IF($B$9=\"\",\"\",ANIMAL!H16)","v":""},{"$f":"IF($B$9=\"\",\"\",ANIMAL!I16)","v":""}]
[]
[null,"Quantité   kg","Aliments                                       (valeurs / kg MS)","Valeurs alimentaires"]
[null,null,null,"MS","UEM","UFL","PDIN","PDIE","Pabs","Caabs"]
[null,{"$f":"IF(FOURRAGE!L10=\"\",\"\",FOURRAGE!L10)","v":""},{"$f":"FOURRAGE!E9","v":"          "},{"$f":"FOURRAGE!E15","v":""},{"$f":"FOURRAGE!F15","v":""},{"$f":"FOURRAGE!G15","v":""},{"$f":"FOURRAGE!H15","v":""},{"$f":"FOURRAGE!I15","v":""},{"$f":"FOURRAGE!J15","v":""},{"$f":"FOURRAGE!L15","v":""}]
[null,null,null,{"$f":"IF(B13=\"\",\"\",B13*(D13/100))","v":""},{"$f":"IF($D$14=\"\",\"\",$D$14*E13)","v":""},"","","","",""]
[null,{"$f":"IF(FOURRAGE!L24=\"\",\"\",FOURRAGE!L24)","v":""},{"$f":"FOURRAGE!E23","v":"          "},{"$f":"IF(C15=\"\",\"\",FOURRAGE!E29)","v":""},{"$f":"IF(C15=\"\",\"\",FOURRAGE!F29)","v":""},{"$f":"IF(C15=\"\",\"\",FOURRAGE!G29)","v":""},{"$f":"IF(C15=\"\",\"\",FOURRAGE!H29)","v":""},{"$f":"IF(C15=\"\",\"\",FOURRAGE!I29)","v":""},{"$f":"IF(C15=\"\",\"\",FOURRAGE!J29)","v":""},{"$f":"IF(C15=\"\",\"\",FOURRAGE!L29)","v":""}]
[null,null,null,{"$f":"IF(B15=\"\",\"\",B15*(D15/100))","v":""},{"$f":"IF($D$16=\"\",\"\",$D$16*E15)","v":""},"","","","",""]
[null,{"$f":"IF(SUM(B13,B15)=0,\"\",SUM(B13,B15))","v":""},"Ration de base",{"$f":"IF(B17=\"\",\"\",SUM(D14,D16))","v":""},{"$f":"IF(B17=\"\",\"\",SUM(E14,E16))","v":""},{"$f":"IF(B17=\"\",\"\",SUM(F14,F16))","v":""},{"$f":"IF(B17=\"\",\"\",SUM(G14,G16))","v":""},{"$f":"IF(B17=\"\",\"\",SUM(H14,H16))","v":""},{"$f":"IF(B17=\"\",\"\",SUM(I14,I16))","v":""},{"$f":"IF(B17=\"\",\"\",SUM(J14,J16))","v":""}]
[]
[null,"Différence",null,null,{"$f":"IF(E9=\"\",\"\",E17-E9)","v":""},"","","","",""]
[]
[null,{"$f":"IF(CONCENTRE!K9=\"\",\"\",CONCENTRE!K9)","v":""},{"$f":"IF(B21=\"\",\"\",CONCENTRE!C10)","v":""},null,null,{"$f":"IF(C21=\"\",\"\",CONCENTRE!E10)","v":""},{"$f":"IF(C21=\"\",\"\",CONCENTRE!F10)","v":""},{"$f":"IF(C21=\"\",\"\",CONCENTRE!G10)","v":""},{"$f":"IF(C21=\"\",\"\",CONCENTRE!H10)","v":""},{"$f":"IF(C21=\"\",\"\",CONCENTRE!I10)","v":""}]
[null,null,null,null,null,{"$f":"IF(B21=\"\",\"\",$B$21*F21)","v":""},{"$f":"IF(B21=\"\",\"\",$B$21*G21)","v":""},{"$f":"IF(B21=\"\",\"\",$B$21*H21)","v":""},{"$f":"IF(B21=\"\",\"\",$B$21*I21)","v":""},{"$f":"IF(B21=\"\",\"\",$B$21*J21)","v":""}]
[null,{"$f":"IF(CONCENTRE!K16=\"\",\"\",CONCENTRE!K16)","v":""},{"$f":"IF(B23=\"\",\"\",CONCENTRE!C17)","v":""},null,null,{"$f":"IF(C23=\"\",\"\",CONCENTRE!E17)","v":""},{"$f":"IF(C23=\"\",\"\",CONCENTRE!F17)","v":""},{"$f":"IF(C23=\"\",\"\",CONCENTRE!G17)","v":""},{"$f":"IF(C23=\"\",\"\",CONCENTRE!H17)","v":""},{"$f":"IF(C23=\"\",\"\",CONCENTRE!I17)","v":""}]
[null,null,null,null,null,{"$f":"IF(B23=\"\",\"\",$B$23*F23)","v":""},{"$f":"IF(B23=\"\",\"\",$B$23*G23)","v":""},{"$f":"IF(B23=\"\",\"\",$B$23*H23)","v":""},{"$f":"IF(B23=\"\",\"\",$B$23*I23)","v":""},{"$f":"IF(B23=\"\",\"\",$B$23*J23)","v":""}]
[null,{"$f":"IF(SUM(B21,B23)=0,\"\",SUM(B21,B23))","v":""},"Concentrés",null,null,{"$f":"IF(B25=\"\",\"\",SUM(F22,F24))","v":""},{"$f":"IF(B25=\"\",\"\",SUM(G22,G24))","v":""},{"$f":"IF(B25=\"\",\"\",SUM(H22,H24))","v":""},{"$f":"IF(B25=\"\",\"\",SUM(I22,I24))","v":""},{"$f":"IF(B25=\"\",\"\",SUM(J22,J24))","v":""}]
[]
[null,"RMIC =","  PDIN - PDIE",{"$f":"IF(D30=\"\",\"\",(G30-H30)/F30)","v":""}," *",{"$f":"IF(CMV!C8=\"\",\"\",(CMV!C12)/1000)","v":""},{"$f":"IF(F27=\"\",\"\",CMV!L8)","v":""},null,{"$f":"CMV!G14","v":""},{"$f":"CMV!I14","v":""}]
[null,null,"        UFL",null,null,null,null,null,{"$f":"IF(F27=\"\",\"\",I27*F27)","v":""},{"$f":"IF(F27=\"\",\"\",J27*F27)","v":""}]
[]
[null,{"$f":"IF(B17=\"\",\"\",SUM(B17,B25,F27))","v":""},"TOTAL RATION",{"$f":"D17","v":""},{"$f":"E17","v":""},{"$f":"IF(F19=\"\",\"\",SUM(F25,F17))","v":""},{"$f":"IF(G19=\"\",\"\",SUM(G25,G17))","v":""},{"$f":"IF(H19=\"\",\"\",SUM(H25,H17))","v":""},{"$f":"IF(I19=\"\",\"\",SUM(I25,I17,I28))","v":""},{"$f":"IF(J19=\"\",\"\",SUM(J25,J17,J28))","v":""}]
[]
[null,null,"Différence",null,{"$f":"IF(B17=\"\",\"\",E30-E9)","v":""},{"$f":"IF($B$17=\"\",\"\",F30-F9)","v":""},{"$f":"IF($B$17=\"\",\"\",G30-G9)","v":""},{"$f":"IF($B$17=\"\",\"\",H30-H9)","v":""},{"$f":"IF($B$17=\"\",\"\",I30-I9)","v":""},{"$f":"IF($B$17=\"\",\"\",J30-J9)","v":""}]
[" * RMIC < - 12 (Brebis allaitantes - agneaux simples)                            RMIC < - 6 (Brebis allaitantes - agneaux doubles)",null,null,null,{"$f":"IF(E32=\"\",\"\",IF(E32>0,\"ATTENTION ! La capacité d'ingestion est dépassée: REDUISEZ LES QUANTITES DE FOURRAGE\",\"\"))","v":""}]
[]
[]
["Commentaires:  . . . . . . .  . . . . . . . . .  . . . .  . . . . . . .  . . . . . . .  . . . . . . .  . . . . . . .  . . . . . . .  . . . . . . .  . . . . . . .  . . . . . . . "]
[]
[" . . . . . . . . . . . . . . . . . . . . . . . . . . . . . . . . . . . . . . . . . . . . . . . . . . . . . . . . . . . . . . . . . . . . . . . . . . . . . . . . . . . . . . . . . . . . . ."]
[]
[" . . . . . . . . . . . . . . . . . . . . . . . . . . . . . . . . . . . . . . . . . . . . . . . . . . . . . . . . . . . . . . . . . . . . . . . . . . . . . . . . . . . . . . . . . . . . . ."]

{"sheet":"IMPRIMCOUT","index":13,"n_rows":77,"n_cols":13,"rows_kept":77,"cut":false,"hidden":false,"merged":[[17,1,18,1],[17,2,18,2],[17,3,18,3],[9,1,10,1],[9,2,10,2],[9,3,10,3],[11,1,12,1],[13,1,14,1],[13,2,14,2],[13,3,14,3],[15,1,16,1],[15,2,16,2],[15,3,16,3],[4,12,7,12],[2,6,2,12],[11,2,12,2],[11,3,12,3],[5,2,6,2],[1,1,2,4],[5,1,6,1],[7,1,8,1],[7,2,8,2],[7,3,8,3],[5,3,5,10]]}
[]
[null,"ALIM'ovins(v. 5.1) "]
[null,null,null,null,null,"Nom:","OVIMASH Bélier"]
[null,"FORMULATION ET CALCUL DU COUT D'UN CONCENTRE FERMIER"]
[null,null,null,null,null,null,null,null,null,null,null,{"$f":"COUT!N6","v":0},{"$f":"COUT!O6","v":"Coût des matières premières                  (€ /tonne)"}]
[null,{"$f":"COUT!B7","v":"Quantités     kg"},{"$f":"COUT!C7","v":"Matières premières"},{"$f":"COUT!E7","v":"Valeurs alimentaires"}]
[null,null,null,{"$f":"COUT!E8","v":"%"},{"$f":"COUT!F8","v":"UFL"},{"$f":"COUT!H8","v":"PDIN"},{"$f":"COUT!I8","v":"PDIE"},{"$f":"COUT!J8","v":"Pabs"},{"$f":"COUT!K8","v":"Caabs"},"MAT","CB"]
[null,{"$f":"IF(COUT!B9=\"\",\"\",COUT!B9)","v":""},{"$f":"IF(COUT!D9=\"\",\"\",COUT!D9)","v":""},{"$f":"COUT!E9","v":""},{"$f":"COUT!F9","v":""},{"$f":"COUT!H9","v":""},{"$f":"COUT!I9","v":""},{"$f":"COUT!J9","v":""},{"$f":"COUT!K9","v":""},{"$f":"COUT!L9","v":""},{"$f":"COUT!M9","v":""}]
[null,null,null,null,{"$f":"COUT!F10","v":""},{"$f":"COUT!H10","v":""},{"$f":"COUT!I10","v":""},{"$f":"COUT!J10","v":""},{"$f":"COUT!K10","v":""},{"$f":"COUT!L10","v":""},{"$f":"COUT!M10","v":""},null,{"$f":"COUT!O10","v":0}]
[null,{"$f":"IF(COUT!B11=\"\",\"\",COUT!B11)","v":""},{"$f":"IF(COUT!D11=\"\",\"\",COUT!D11)","v":""},{"$f":"COUT!E11","v":""},{"$f":"COUT!F11","v":""},{"$f":"COUT!H11","v":""},{"$f":"COUT!I11","v":""},{"$f":"COUT!J11","v":""},{"$f":"COUT!K11","v":""},{"$f":"COUT!L11","v":""},{"$f":"COUT!M11","v":""}]
[null,null,null,null,{"$f":"COUT!F12","v":""},{"$f":"COUT!H12","v":""},{"$f":"COUT!I12","v":""},{"$f":"COUT!J12","v":""},{"$f":"COUT!K12","v":""},{"$f":"COUT!L12","v":""},{"$f":"COUT!M12","v":""},null,{"$f":"COUT!O12","v":0}]
[null,{"$f":"IF(COUT!B13=\"\",\"\",COUT!B13)","v":""},{"$f":"IF(COUT!D13=\"\",\"\",COUT!D13)","v":""},{"$f":"COUT!E13","v":""},{"$f":"COUT!F13","v":""},{"$f":"COUT!H13","v":""},{"$f":"COUT!I13","v":""},{"$f":"COUT!J13","v":""},{"$f":"COUT!K13","v":""},{"$f":"COUT!L13","v":""},{"$f":"COUT!M13","v":""}]
[null,null,null,null,{"$f":"COUT!F14","v":""},{"$f":"COUT!H14","v":""},{"$f":"COUT!I14","v":""},{"$f":"COUT!J14","v":""},{"$f":"COUT!K14","v":""},{"$f":"COUT!L14","v":""},{"$f":"COUT!M14","v":""},null,{"$f":"COUT!O14","v":0}]
[null,{"$f":"IF(COUT!B15=\"\",\"\",COUT!B15)","v":""},{"$f":"IF(COUT!D15=\"\",\"\",COUT!D15)","v":""},{"$f":"COUT!E15","v":""},{"$f":"COUT!F15","v":""},{"$f":"COUT!H15","v":""},{"$f":"COUT!I15","v":""},{"$f":"COUT!J15","v":""},{"$f":"COUT!K15","v":""},{"$f":"COUT!L15","v":""},{"$f":"COUT!M15","v":""}]
[null,null,null,null,{"$f":"COUT!F16","v":""},{"$f":"COUT!H16","v":""},{"$f":"COUT!I16","v":""},{"$f":"COUT!J16","v":""},{"$f":"COUT!K16","v":""},{"$f":"COUT!L16","v":""},{"$f":"COUT!M16","v":""},null,{"$f":"COUT!O16","v":0}]
[null,{"$f":"IF(COUT!B17=\"\",\"\",COUT!B17)","v":""},{"$f":"IF(COUT!D17=\"\",\"\",COUT!D17)","v":""},{"$f":"COUT!E17","v":""},{"$f":"COUT!F17","v":""},{"$f":"COUT!H17","v":""},{"$f":"COUT!I17","v":""},{"$f":"COUT!J17","v":""},{"$f":"COUT!K17","v":""},{"$f":"COUT!L17","v":""},{"$f":"COUT!M17","v":""}]
[null,null,null,null,{"$f":"COUT!F18","v":""},{"$f":"COUT!H18","v":""},{"$f":"COUT!I18","v":""},{"$f":"COUT!J18","v":""},{"$f":"COUT!K18","v":""},{"$f":"COUT!L18","v":""},{"$f":"COUT!M18","v":""},null,{"$f":"COUT!O18","v":0}]
[null,{"$f":"IF(COUT!B19=\"\",\"\",COUT!B19)","v":""},{"$f":"IF(COUT!D19=\"\",\"\",COUT!D19)","v":""},{"$f":"COUT!E19","v":""},{"$f":"COUT!F19","v":""},{"$f":"COUT!H19","v":""},{"$f":"COUT!I19","v":""},{"$f":"COUT!J19","v":""},{"$f":"COUT!K19","v":""},{"$f":"COUT!L19","v":""},{"$f":"COUT!M19","v":""}]
[null,null,null,null,{"$f":"COUT!F20","v":""},{"$f":"COUT!H20","v":""},{"$f":"COUT!I20","v":""},{"$f":"COUT!J20","v":""},{"$f":"COUT!K20","v":""},{"$f":"COUT!L20","v":""},{"$f":"COUT!M20","v":""},null,{"$f":"COUT!O20","v":0}]
[]
[null,null,null,null,null,null,null,null,null,null,null,null,{"$f":"COUT!O22","v":"COUT € / kg"}]
[null,{"$f":"COUT!B23","v":0},{"$f":"COUT!D23","v":"Mon aliment"},{"$f":"COUT!E23","v":""},{"$f":"COUT!F23","v":""},{"$f":"COUT!H23","v":""},{"$f":"COUT!I23","v":""},{"$f":"COUT!J23","v":""},{"$f":"COUT!K23","v":""},{"$f":"COUT!L23","v":""},{"$f":"COUT!M23","v":""},{"$f":"COUT!N23","v":0},{"$f":"COUT!O23","v":""}]
[]
[]
[]
[]
[null,null,"Catégorie","C","U.F.L.","P.D.I.N.","P.D.I.E.","Pabs","Caabs"]
[null,null,"Aliment complet",null,{"$f":"#REF!","v":{"$error":"#REF!"}},{"$f":"#REF!","v":{"$error":"#REF!"}},{"$f":"#REF!","v":{"$error":"#REF!"}},{"$f":"#REF!","v":{"$error":"#REF!"}},{"$f":"#REF!","v":{"$error":"#REF!"}}]
[null,null,"Aliment divers",null,{"$f":"#REF!","v":{"$error":"#REF!"}},{"$f":"#REF!","v":{"$error":"#REF!"}},{"$f":"#REF!","v":{"$error":"#REF!"}},{"$f":"#REF!","v":{"$error":"#REF!"}},{"$f":"#REF!","v":{"$error":"#REF!"}}]
[null,null,"Avoine",null,0.77,61,61,2.7,0.7]
[null,null,"Bicarbonate de Na",null,0,0,0,0,0]
[null,null,"Blé",null,1.02,70,89,2.6,0.4]
[null,null,"Carbonate de Ca",null,0,0,0,0,150]
[null,null,"CMV 0 - 27 (Gravelle)",null,0,0,0,0,108]
[null,null,"CMV 10 - 20",null,0,0,0,65,80]
[null,null,"CMV 10 - 6",null,0,0,0,65,24]
[null,null,"CMV 12 - 12",null,0,0,0,78,48]
[null,null,"CMV 12 - 12",null,0,0,0,78,48]
[null,null,"CMV 4 - 21",null,0,0,0,26,84]
[null,null,"CMV 5 - 20",null,0,0,0,32,80]
[null,null,"CMV 5 - 25",null,0,0,0,32,100]
[null,null,"CMV 6 - 6",null,0,0,0,39,24]
[null,null,"CMV 7 - 21",null,0,0,0,15,84]
[null,null,"CMV 8 - 12 ",null,0,0,0,52,48]
[null,null,"CMV 8 - 16 ",null,0,0,0,52,64]
[null,null,"CMV 8 - 24",null,0,0,0,52,96]
[null,null,"CMV 9 - 14",null,0,0,0,58,56]
[null,null,"Complémentaire azoté",null,{"$f":"#REF!","v":{"$error":"#REF!"}},{"$f":"#REF!","v":{"$error":"#REF!"}},{"$f":"#REF!","v":{"$error":"#REF!"}},{"$f":"#REF!","v":{"$error":"#REF!"}},{"$f":"#REF!","v":{"$error":"#REF!"}}]
[null,null,"Drêches",null,0.76,178,157,4.9000000000000004,1.3]
[null,null,"Féverole",null,1.03,170,97,4.0999999999999996,0.9]
[null,null,"Graines Colza",null,1.68,12,61,5.3,2.8]
[null,null,"Graines Coton",null,0.94,131,77,5.0999999999999996,1]
[null,null,"Huile de colza",null,2.73,0,0,0,0]
[null,null,"Lupin Blanc",null,1.18,213,106,3.2,2.1]
[null,null,"Luzerne déhydratée",null,0.62,103,91,1.9,6.5]
[null,null,"Maïs grain",null,1.06,64,84,2.2000000000000002,0.3]
[null,null,"Mélange 2/3   O - 1/3 S",null,0.98666666568000005,156.33333317699999,134.33333319900001,3.666666663,1.0333333323]
[null,null,"Mélange 2/3   T - 1/3 C",null,0.95666666571000003,114.99999988500001,101.999999898,5.0666666616000002,2.0666666646]
[null,null,"Mélange 3/4   O - 1/4 S",null,0.97749999999999992,134.5,122.5,3.5,0.9]
[null,null,"Mélange 80 %   O - 20 % S",null,0.97199999999999998,121.4,115.4,3.4000000000000004,0.82000000000000006]
[null,null,"Mélasse",null,0.75,63,54,0.2,0.5]
[null,null,"Mon concentré",null,{"$f":"COUT!F7","v":0},{"$f":"COUT!H7","v":0},{"$f":"COUT!I7","v":0},{"$f":"COUT!J7","v":0},{"$f":"COUT!K7","v":0}]
[null,null,"Orge",null,0.95,69,87,3,0.5,null,null,0]
[null,null,"Pois",null,1.04,130,83,3.4,0.7,null,null,100]
[null,null,"Poudre de lait écrémé",null,1.1499999999999999,196,75,9.6999999999999993,11.7,null,null,100]
[null,null,"Pulpe de betterave",null,0.89,59,97,0.9,3,null,null,120]
[null,null,"Sarrazin",null,0.81,77,82,2.6,0.5,null,null,120]
[null,null,"Seigle",null,1.03,59,85,2.6,0.7,null,null,40]
[null,null,"Sorgho",null,1.05,67,87,2.4,0.2,null,null,50]
[null,null,"Tourteau Arachide",null,1,347,215,4.0999999999999996,1.2,null,null,50]
[null,null,"Tourteau Colza 35",null,0.85,219,138,9.1999999999999993,5.2,null,null,60]
[null,null,"Tourteau Lin",null,0.88,227,179,6,2.8,null,null,70]
[null,null,"Tourteau Soja 48",null,1.06,331,229,5,2.1,null,null,80]
[null,null,"Tourteau Tournesol",null,0.56000000000000005,178,93,7.4,2.4,null,null,80]
[null,null,"Triticale",null,1.01,63,84,3,0.5,null,null,80]
[null,null,"Urée",null,0,1443,0,0,0,null,null,90]
[null,null,"Vesce",null,1.02,161,90,3.8,1,null,null,0]

{"sheet":"AGNEAU","index":14,"n_rows":211,"n_cols":31,"rows_kept":211,"cut":false,"hidden":false,"merged":[[69,17,69,19],[70,17,70,19],[65,17,65,19],[66,17,66,19],[67,17,67,19],[68,17,68,19],[61,17,61,18],[62,17,62,18],[23,27,24,27],[23,26,24,26],[23,25,24,25],[23,24,24,24],[23,23,24,23],[26,24,27,27],[26,22,27,23],[222,10,222,11],[217,10,217,11],[218,10,218,11],[219,10,219,11],[220,10,220,11],[221,10,221,11],[17,3,17,4],[5,11,7,17],[8,15,9,15],[8,11,9,13],[7,4,9,7],[11,4,11,7],[16,2,16,7],[12,12,13,14],[5,5,6,7],[5,1,6,4],[0,1,0,27],[12,20,13,20],[10,20,11,20],[8,20,9,20],[8,22,9,22],[10,22,11,22],[12,22,13,22],[1,1,1,27],[3,1,3,27],[6,21,7,22],[6,20,7,20],[4,20,5,22],[23,3,24,4],[26,1,26,2],[26,3,26,4],[26,7,26,9],[6,23,6,27],[8,16,9,16],[20,27,21,27],[20,26,21,26],[20,25,21,25],[20,24,21,24],[20,23,21,23],[12,16,13,16],[8,21,9,21],[10,21,11,21],[12,21,13,21],[14,21,15,21],[18,1,19,1],[18,2,19,2],[18,3,19,4],[23,9,24,9],[25,13,26,13],[25,11,26,12],[23,11,24,13],[16,10,18,16],[22,2,22,5],[23,7,24,7],[23,5,24,6],[26,5,26,6],[18,6,19,6],[18,5,19,5],[18,7,19,7],[23,1,24,2],[19,10,19,13],[23,15,24,16],[10,13,11,17],[10,12,11,12],[18,20,19,20],[16,20,17,20],[14,20,15,20],[22,7,22,16],[22,20,22,27],[16,21,17,21],[19,14,19,16],[12,15,13,15],[20,22,21,22],[20,20,21,20],[25,15,26,16],[23,22,24,22],[23,20,24,20],[14,22,15,22],[16,22,17,22],[18,22,19,22],[18,21,19,21],[26,19,27,21],[20,21,21,21]]}
[null,"ALIM'ovins(v. 5.1) "]
[null,"Rationnement des ovins "]
[]
[null,"Agneau"]
[null,null,null,null,null,null,null,null,null,null,null,null,null,null,null,null,null,null,null,null,"             3 Composez votre concentré \"agneau\""]
[null,"        1 Cliquez sur les flèches                 ou cochez les cases",null,null,null,"CATEGORIE",null,null,null,null,null,"CHOIX DU CONCENTRE"]
[null,null,null,null,null,null,null,null,null,null,null,null,null,null,null,null,null,null,null,null,"%","Matières premières",null,"Valeurs alimentaires"]
[null,null,null,null,{"$f":"IF(C12=\"\",\"\",CONCATENATE(IF(I33=1,\"mâle\",\"femelle\"),\" de race \",IF(I36=TRUE,\"à viande\",\"rustique ou croisée\"),\"                                                                                               poids \",C12,\"  -  GMQ   \",C14))","v":""},null,null,null,null,null,null,null,null,null,null,null,null,null,null,null,null,null,null,"UFV","PDIN","PDIE","Pabs","Caabs"]
[null,null,null,null,null,null,null,null,null,null,null,"Valeur U.F.V.                de l'aliment",null,null,null,{"$f":"IF(E8=\"\",\"\",M38)","v":""},{"$f":"IF(P9=\"\",\"\",\"UFV / kg\")","v":""},null,null,null,null,null,null,{"$f":"IF(U9=\"\",\"\",IF(V9=\"Mes_concentrés\",VLOOKUP(W9,NOUVEAU!$R$22:$AA$38,4),VLOOKUP($W9,$W44:$AC93,3)))","v":""},{"$f":"IF(U9=\"\",\"\",IF(V9=\"Mes_concentrés\",VLOOKUP(W9,NOUVEAU!$R$22:$AA$38,5),VLOOKUP($W9,$W44:$AC93,4)))","v":""},{"$f":"IF(U9=\"\",\"\",IF(V9=\"Mes_concentrés\",VLOOKUP(W9,NOUVEAU!$R$22:$AA$38,6),VLOOKUP($W9,$W44:$AC93,5)))","v":""},{"$f":"IF(U9=\"\",\"\",IF(V9=\"Mes_concentrés\",VLOOKUP(W9,NOUVEAU!$R$22:$AA$38,7),VLOOKUP($W9,$W44:$AC93,6)))","v":""},{"$f":"IF(U9=\"\",\"\",IF(V9=\"Mes_concentrés\",VLOOKUP(W9,NOUVEAU!$R$22:$AA$38,8),VLOOKUP($W9,$W44:$AC93,7)))","v":""}]
[null,null,null,null,null,null,null,null,null,null,null,null,null,null,null,null,null,null,null,null,null,null,null,{"$f":"IF(U9=\"\",\"\",($U$9/100)*X9)","v":""},{"$f":"IF(U9=\"\",\"\",($U$9/100)*Y9)","v":""},{"$f":"IF(U9=\"\",\"\",($U$9/100)*Z9)","v":""},{"$f":"IF(U9=\"\",\"\",($U$9/100)*AA9)","v":""},{"$f":"IF(U9=\"\",\"\",($U$9/100)*AB9)","v":""}]
[null,null,null,null,null,null,null,null,null,null,null,null,2,"faites varier la teneur avec les flèches",null,null,null,null,null,null,null,null,null,{"$f":"IF(U11=\"\",\"\",IF(V11=\"Mes_concentrés\",VLOOKUP(W11,NOUVEAU!$R$22:$AA$38,4),VLOOKUP($W11,$W44:$AC93,3)))","v":""},{"$f":"IF(U11=\"\",\"\",IF(V11=\"Mes_concentrés\",VLOOKUP(W11,NOUVEAU!$R$22:$AA$38,5),VLOOKUP($W11,$W44:$AC93,4)))","v":""},{"$f":"IF(U11=\"\",\"\",IF(V11=\"Mes_concentrés\",VLOOKUP(W11,NOUVEAU!$R$22:$AA$38,6),VLOOKUP($W11,$W44:$AC93,5)))","v":""},{"$f":"IF(U11=\"\",\"\",IF(V11=\"Mes_concentrés\",VLOOKUP(W11,NOUVEAU!$R$22:$AA$38,7),VLOOKUP($W11,$W44:$AC93,6)))","v":""},{"$f":"IF(U11=\"\",\"\",IF(V11=\"Mes_concentrés\",VLOOKUP(W11,NOUVEAU!$R$22:$AA$38,8),VLOOKUP($W11,$W44:$AC93,7)))","v":""}]
[null,"Poids",null,null,"BESIONS ALIMENTAIRES",null,null,null,null,null,null,null,null,null,null,null,null,null,null,null,null,null,null,{"$f":"IF(U11=\"\",\"\",($U$11/100)*X11)","v":""},{"$f":"IF(U11=\"\",\"\",($U$11/100)*Y11)","v":""},{"$f":"IF(U11=\"\",\"\",($U$11/100)*Z11)","v":""},{"$f":"IF(U11=\"\",\"\",($U$11/100)*AA11)","v":""},{"$f":"IF(U11=\"\",\"\",($U$11/100)*AB11)","v":""}]
[null,null,null,null,"U.F.V.","P.D.I.","Pabs","Caabs",null,null,null,null,"Quantités nécessaires",null,null,{"$f":"IF(E8=\"\",\"\",IF(E14=\"ND\",\"\",E14/P9))","v":""},{"$f":"IF(E8=\"\",\"\",\"kg /jour\")","v":""},null,null,null,null,null,null,{"$f":"IF(U13=\"\",\"\",IF(V13=\"Mes_concentrés\",VLOOKUP(W13,NOUVEAU!$R$22:$AA$38,4),VLOOKUP($W13,$W44:$AC93,3)))","v":""},{"$f":"IF(U13=\"\",\"\",IF(V13=\"Mes_concentrés\",VLOOKUP(W13,NOUVEAU!$R$22:$AA$38,5),VLOOKUP($W13,$W44:$AC93,4)))","v":""},{"$f":"IF(U13=\"\",\"\",IF(V13=\"Mes_concentrés\",VLOOKUP(W13,NOUVEAU!$R$22:$AA$38,6),VLOOKUP($W13,$W44:$AC93,5)))","v":""},{"$f":"IF(U13=\"\",\"\",IF(V13=\"Mes_concentrés\",VLOOKUP(W13,NOUVEAU!$R$22:$AA$38,7),VLOOKUP($W13,$W44:$AC93,6)))","v":""},{"$f":"IF(U13=\"\",\"\",IF(V13=\"Mes_concentrés\",VLOOKUP(W13,NOUVEAU!$R$22:$AA$38,8),VLOOKUP($W13,$W44:$AC93,7)))","v":""}]
[null,"GMQ",null,null,{"$f":"IF(E8=\"\",\"\",VLOOKUP(E8,G43:K211,2))","v":""},{"$f":"IF(E8=\"\",\"\",VLOOKUP(E8,G43:K211,3))","v":""},{"$f":"IF(E8=\"\",\"\",VLOOKUP(E8,G43:K211,4))","v":""},{"$f":"IF(E8=\"\",\"\",VLOOKUP(E8,G43:K211,5))","v":""},null,null,null,null,null,null,null,null,null,null,null,null,null,null,null,{"$f":"IF(U13=\"\",\"\",($U$13/100)*X13)","v":""},{"$f":"IF(U13=\"\",\"\",($U$13/100)*Y13)","v":""},{"$f":"IF(U13=\"\",\"\",($U$13/100)*Z13)","v":""},{"$f":"IF(U13=\"\",\"\",($U$13/100)*AA13)","v":""},{"$f":"IF(Z13=\"\",\"\",($U$13/100)*AB13)","v":""}]
[null,null,null,null,null,null,null,null,null,null,null,null,null,null,null,null,null,null,null,null,null,null,null,{"$f":"IF(U15=\"\",\"\",IF(V15=\"Mes_concentrés\",VLOOKUP(W15,NOUVEAU!$R$22:$AA$38,4),VLOOKUP($W15,$W44:$AC93,3)))","v":""},{"$f":"IF(U15=\"\",\"\",IF(V15=\"Mes_concentrés\",VLOOKUP(W15,NOUVEAU!$R$22:$AA$38,5),VLOOKUP($W15,$W44:$AC93,4)))","v":""},{"$f":"IF(U15=\"\",\"\",IF(V15=\"Mes_concentrés\",VLOOKUP(W15,NOUVEAU!$R$22:$AA$38,6),VLOOKUP($W15,$W44:$AC93,5)))","v":""},{"$f":"IF(U15=\"\",\"\",IF(V15=\"Mes_concentrés\",VLOOKUP(W15,NOUVEAU!$R$22:$AA$38,7),VLOOKUP($W15,$W44:$AC93,6)))","v":""},{"$f":"IF(U15=\"\",\"\",IF(V15=\"Mes_concentrés\",VLOOKUP(W15,NOUVEAU!$R$22:$AA$38,8),VLOOKUP($W15,$W44:$AC93,7)))","v":""}]
[null,null,null,null,null,null,null,null,null,null,null,null,null,null,null,null,null,null,null,null,null,null,null,{"$f":"IF(U15=\"\",\"\",($U$15/100)*X15)","v":""},{"$f":"IF(U15=\"\",\"\",($U$15/100)*Y15)","v":""},{"$f":"IF(U15=\"\",\"\",($U$15/100)*Z15)","v":""},{"$f":"IF(U15=\"\",\"\",($U$15/100)*AA15)","v":""},{"$f":"IF(U15=\"\",\"\",($U$15/100)*AB15)","v":""}]
[null,null,"COMPOSITION DE L'ALIMENT",null,null,null,null,null,null,null,"DUREE D'ENGRAISSEMENT     (jours restants jusqu'à 40 kg)",null,null,null,null,null,null,null,null,null,null,null,null,{"$f":"IF(U17=\"\",\"\",IF(V17=\"Mes_concentrés\",VLOOKUP(W17,NOUVEAU!$R$22:$AA$38,4),VLOOKUP($W17,$W44:$AC93,3)))","v":""},{"$f":"IF(U17=\"\",\"\",IF(V17=\"Mes_concentrés\",VLOOKUP(W17,NOUVEAU!$R$22:$AA$38,5),VLOOKUP($W17,$W44:$AC93,4)))","v":""},{"$f":"IF(U17=\"\",\"\",IF(V17=\"Mes_concentrés\",VLOOKUP(W17,NOUVEAU!$R$22:$AA$38,6),VLOOKUP($W17,$W44:$AC93,5)))","v":""},{"$f":"IF(U17=\"\",\"\",IF(V17=\"Mes_concentrés\",VLOOKUP(W17,NOUVEAU!$R$22:$AA$38,7),VLOOKUP($W17,$W44:$AC93,6)))","v":""},{"$f":"IF(U17=\"\",\"\",IF(V17=\"Mes_concentrés\",VLOOKUP(W17,NOUVEAU!$R$22:$AA$38,8),VLOOKUP($W17,$W44:$AC93,7)))","v":""}]
[null,null,"U.F.V.","P.D.I.",null,"Pabs","Caabs","Ca / P",null,null,null,null,null,null,null,null,null,null,null,null,null,null,null,{"$f":"IF(U17=\"\",\"\",($U$17/100)*X17)","v":""},{"$f":"IF(U17=\"\",\"\",($U$17/100)*Y17)","v":""},{"$f":"IF(U17=\"\",\"\",($U$17/100)*Z17)","v":""},{"$f":"IF(U17=\"\",\"\",($U$17/100)*AA17)","v":""},{"$f":"IF(U17=\"\",\"\",($U$17/100)*AB17)","v":""}]
[null," / kg brut",{"$f":"P9","v":""},{"$f":"IF(E8=\"\",\"\",F14/P13)","v":""},null,{"$f":"IF(E8=\"\",\"\",G14/P13)","v":""},{"$f":"IF(E8=\"\",\"\",H14/P13)","v":""},{"$f":"IF(E8=\"\",\"\",G19/F19)","v":""},null,null,null,null,null,null,null,null,null,null,null,null,null,null,null,{"$f":"IF(U19=\"\",\"\",IF(V19=\"Mes_concentrés\",VLOOKUP(W19,NOUVEAU!$R$22:$AA$38,4),VLOOKUP($W19,$W44:$AC93,3)))","v":""},{"$f":"IF(U19=\"\",\"\",IF(V19=\"Mes_concentrés\",VLOOKUP(W19,NOUVEAU!$R$22:$AA$38,5),VLOOKUP($W19,$W44:$AC93,4)))","v":""},{"$f":"IF(U19=\"\",\"\",IF(V19=\"Mes_concentrés\",VLOOKUP(W19,NOUVEAU!$R$22:$AA$38,6),VLOOKUP($W19,$W44:$AC93,5)))","v":""},{"$f":"IF(U19=\"\",\"\",IF(V19=\"Mes_concentrés\",VLOOKUP(W19,NOUVEAU!$R$22:$AA$38,7),VLOOKUP($W19,$W44:$AC93,6)))","v":""},{"$f":"IF(U19=\"\",\"\",IF(V19=\"Mes_concentrés\",VLOOKUP(W19,NOUVEAU!$R$22:$AA$38,8),VLOOKUP($W19,$W44:$AC93,7)))","v":""}]
[null,null,null,null,null,null,null,null,null,null,{"$f":"(40-Q34)/(Q35/1000)","v":0},null,null,null,"jours",null,null,null,null,null,null,null,null,{"$f":"IF(U19=\"\",\"\",($U$19/100)*X19)","v":""},{"$f":"IF(U19=\"\",\"\",($U$19/100)*Y19)","v":""},{"$f":"IF(U19=\"\",\"\",($U$19/100)*Z19)","v":""},{"$f":"IF(U19=\"\",\"\",($U$19/100)*AA19)","v":""},{"$f":"IF(U19=\"\",\"\",($U$19/100)*AB19)","v":""}]
[null,null,null,null,null,null,null,null,null,null,null,null,null,null,null,null,null,null,null,null,{"$f":"IF(SUM(U9,U11,U13,U15,U17,U19)=0,\"\",SUM(U9:U20))","v":""},null,"Concentrés",{"$f":"IF(U9=\"\",\"\",SUM(X10,X12,X14,X16,X18,X20))","v":""},{"$f":"IF(U9=\"\",\"\",SUM(Y10,Y12,Y14,Y16,Y18,Y20))","v":""},{"$f":"IF(U9=\"\",\"\",SUM(Z10,Z12,Z14,Z16,Z18,Z20))","v":""},{"$f":"IF(U9=\"\",\"\",SUM(AA10,AA12,AA14,AA16,AA18,AA20))","v":""},{"$f":"IF(U9=\"\",\"\",SUM(AB10,AB12,AB14,AB16,AB18,AB20))","v":""}]
[]
[null,null,"Saisissez le prix de l'aliment                                       et le nombre d'agneaux",null,null,null,null,"QUANTITES D'ALIMENTS ET COUTS",null,null,null,null,null,null,null,null,null,null,null,null,{"$f":"CONCATENATE(\"   Votre aliment contient  \",ROUND(Q62,1),\" %  de MAT  et  \",ROUND(Q74,1),\"  %  de Cellulose\")","v":"   Votre aliment contient  0 %  de MAT  et  0  %  de Cellulose"}]
[null,"Prix de l'aliment    (€ / tonne)",null,null,null," Aliment  / jour",null,{"$f":"IF(D27=\"\",\"\",P13*D27)","v":""},null,{"$f":"IF(H24=\"\",\"\",\"kg\")","v":""},null,"Quantité totale d'aliment à prévoir",null,null,null,"Cout total",null,null,null,null,{"$f":"IF(U21=100,\"\",IF(U21>100,\">100%\",\"<100%\"))","v":">100%"},null,"Différence",{"$f":"IF(U9=\"\",\"\",X21-C19)","v":""},{"$f":"IF(U9=\"\",\"\",Y21-D19)","v":""},{"$f":"IF(U9=\"\",\"\",Z21-D19)","v":""},{"$f":"IF(U9=\"\",\"\",AA21-F19)","v":""},{"$f":"IF(U9=\"\",\"\",AB21-G19)","v":""}]
[]
[null,null,null,null,null,null,null,null,null,null,null,{"$f":"IF(D27=\"\",\"\",H24*K20)","v":""},null,{"$f":"IF(L26=\"\",\"\",\"kg\")","v":""},null,{"$f":"IF(D27=\"\",\"\",(D24*L26)/1000)","v":""}]
[null,"Nombre d'agneaux",null,null,null,"Cout /jour",null,{"$f":"IF(D27=\"\",\"\",(P13*D24*D27)/1000)","v":""},null,null,null,null,null,null,null,null,null,null,null,{"$f":"IF(U9=\"\",\"\",IF(Q74<6,\"ATTENTION !  aliment acidogène: augmentez la cellulose\",\"\"))","v":""},null,null,{"$f":"IF(U9=\"\",\"\",IF(C19>X21+0.03,\"Augmentez l'énergie (céréales...)\",IF(C19<X21-0.03,\"Diminuez l'énergie (Pulpe…)\",\"\")))","v":""},null,{"$f":"IF(U9=\"\",\"\",IF(Y24>5,\"Diminez l'azote (Céréales, pulpe…)\",IF(Y24<-5,\"Augmentez l'azote (Tourteau, luzerne…)\",\"\")))","v":""}]
[]
[]
[]
[]
[null,null,null,null,"150 g","Viande",null,"15 kg","Mâle/Femelle"]
[null,null,null,null,"200 g","Rustique",null,"20 kg",1]
[null,null,null,null,"250 g","Laitière",null,"25 kg",null,null,null,null,null,{"$error":"#REF!"},null,null,{"$f":"IF(C12=\"15 kg\",15,IF(C12=\"20 kg\",20,IF(C12=\"25 kg\",25,IF(C12=\"30 kg\",30,IF(C12=\"35 kg\",35,40)))))","v":40}]
[null,null,null,null,"300 g","Croisée",null,"30 kg","Viande/Rustique",null,null,null,null,null,null,null,{"$f":"IF(C14=\"150 g\",150,IF(C14=\"200 g\",200,IF(C14=\"250 g\",250,IF(C14=\"300 g\",300,IF(C14=\"350 g\",350,IF(C14=\"400 g\",400,450))))))","v":450}]
[null,null,null,null,"350 g",null,null,"35 kg",true]
[null,null,null,null,"400 g",null,null,"40 kg"]
[null,null,null,null,"450 g",null,null,null,null,null,null,1,{"$f":"IF(L38=1,0.8,IF(L38=2,0.85,IF(L38=3,0.9,IF(L38=4,0.95,1))))","v":0.8}]
[]
[null,null,null,null,null,null,null,0,null,"UFV / kg"]
[]
[]
[null,null,"Poids vif","GMQ","Potentiel","sexe",null,"UFV","PDI","P","Ca",null,null,null,null,null,null,null,null,null,null,null,"Catégorie","Cu","U.F.V.","P.D.I.N.","P.D.I.E.","Pabs","Caabs","MAT","CB"]
[null,null,"15 kg","150 g","Elevé","femelle","femelle de race à viande                                                                                               poids 15 kg  -  GMQ   150 g","ND","ND","ND","ND",22,null,null,null,null,"Céréale",null,null,null,null,null,"Avoine",3,0.71,61,61,2.4,0.6,11.1,13.8]
[null,null,"15 kg","200 g","Elevé","femelle","femelle de race à viande                                                                                               poids 15 kg  -  GMQ   200 g","ND","ND","ND","ND",23,null,null,null,null,"Tourteau",null,null,null,null,null,"Bicarbonate de Na",0,0,0,0,0,0,0,0]
[null,null,"15 kg","250 g","Elevé","femelle","femelle de race à viande                                                                                               poids 15 kg  -  GMQ   250 g","ND","ND","ND","ND",24,null,null,null,null,"Graines",null,null,null,null,null,"Blé",5,1.02,70,89,2.2999999999999998,0.3,12.1,2.6]
[null,null,"15 kg","300 g","Elevé","femelle","femelle de race à viande                                                                                               poids 15 kg  -  GMQ   300 g","ND","ND","ND","ND",25,null,null,null,null,"Divers",null,null,null,null,null,"Carbonate de Ca",0,0,0,0,0,150,0,0]
[null,null,"15 kg","350 g","Elevé","femelle","femelle de race à viande                                                                                               poids 15 kg  -  GMQ   350 g","ND","ND","ND","ND",26,null,null,null,null,"Minéraux",null,null,null,null,null,"CMV 0 - 27",null,0,0,0,0,108,0,0]
[null,null,"15 kg","400 g","Elevé","femelle","femelle de race à viande                                                                                               poids 15 kg  -  GMQ   400 g","ND","ND","ND","ND",27,null,null,null,null,"Mes_concentrés",null,null,null,null,null,"CMV 10 - 20",null,0,0,0,65,80,0,0]
[null,null,"15 kg","450 g","Elevé","femelle","femelle de race à viande                                                                                               poids 15 kg  -  GMQ   450 g","ND","ND","ND","ND",28,null,null,null,null,null,null,null,null,null,null,"CMV 10 - 6",null,0,0,0,65,24,0,0]
[null,null,"20 kg","150 g","Elevé","femelle","femelle de race à viande                                                                                               poids 20 kg  -  GMQ   150 g",0.73,67,1.9,4.5999999999999996,50,null,null,null,null,null,null,null,null,null,null,"CMV 12 - 12",null,0,0,0,78,48,0,0]
[null,null,"20 kg","200 g","Elevé","femelle","femelle de race à viande                                                                                               poids 20 kg  -  GMQ   200 g",0.77,80,2.2999999999999998,5.7,51,null,null,null,null,null,null,null,null,null,null,"CMV 4 - 21",null,0,0,0,26,84,0,0]
[null,null,"20 kg","250 g","Elevé","femelle","femelle de race à viande                                                                                               poids 20 kg  -  GMQ   250 g",0.8,93,2.7,6.8,52,null,null,null,null,null,null,null,null,null,null,"CMV 5 - 20",null,0,0,0,32,80,0,0]
[null,null,"20 kg","300 g","Elevé","femelle","femelle de race à viande                                                                                               poids 20 kg  -  GMQ   300 g",0.82,106,3,8,53,null,null,null,{"$f":"U9","v":0},{"$f":"VLOOKUP(W9,$W$44:$AD$93,8)","v":{"$error":"#N/A"}},{"$f":"IF(P54=0,0,(Q54/100)*(P54/100))","v":0},null,null,null,null,"CMV 5 - 22",null,0,0,0,32,90,0,0]
[null,null,"20 kg","350 g","Elevé","femelle","femelle de race à viande                                                                                               poids 20 kg  -  GMQ   350 g","ND","ND","ND","ND",54,null,null,null,{"$f":"U11","v":0},{"$f":"VLOOKUP(W11,$W$44:$AD$93,8)","v":{"$error":"#N/A"}},{"$f":"IF(P55=0,0,(Q55/100)*(P55/100))","v":0},null,null,null,null,"CMV 5 - 25",null,0,0,0,32,100,0,0]
[null,null,"20 kg","400 g","Elevé","femelle","femelle de race à viande                                                                                               poids 20 kg  -  GMQ   400 g","ND","ND","ND","ND",55,null,null,null,{"$f":"U13","v":0},{"$f":"VLOOKUP(W13,$W$44:$AD$93,8)","v":{"$error":"#N/A"}},0,null,null,null,null,"CMV 6 - 6",null,0,0,0,39,24,0,0]
[null,null,"20 kg","450 g","Elevé","femelle","femelle de race à viande                                                                                               poids 20 kg  -  GMQ   450 g","ND","ND","ND","ND",56,null,null,null,{"$f":"U15","v":0},{"$f":"VLOOKUP(W15,$W$44:$AD$93,8)","v":{"$error":"#N/A"}},0,null,null,null,null,"CMV 7 - 21",null,0,0,0,15,84,0,0]
[null,null,"25 kg","150 g","Elevé","femelle","femelle de race à viande                                                                                               poids 25 kg  -  GMQ   150 g",0.82,69,2.2000000000000002,5.2,78,null,null,null,{"$f":"U17","v":0},{"$f":"VLOOKUP(W17,$W$44:$AD$93,8)","v":{"$error":"#N/A"}},0,null,null,null,null,"CMV 8 - 12 ",null,0,0,0,52,48,0,0]
[null,null,"25 kg","200 g","Elevé","femelle","femelle de race à viande                                                                                               poids 25 kg  -  GMQ   200 g",0.85,82,2.6,6.4,79,null,null,null,{"$f":"U19","v":0},{"$f":"VLOOKUP(W19,$W$44:$AD$93,8)","v":{"$error":"#N/A"}},0,null,null,null,null,"CMV 8 - 16 ",null,0,0,0,52,64,0,0]
[null,null,"25 kg","250 g","Elevé","femelle","femelle de race à viande                                                                                               poids 25 kg  -  GMQ   250 g",0.89,94,3,7.6,80,null,null,null,null,null,null,null,null,null,null,"CMV 8 - 24",null,0,0,0,52,96,0,0]
[null,null,"25 kg","300 g","Elevé","femelle","femelle de race à viande                                                                                               poids 25 kg  -  GMQ   300 g",0.92,107,3.3,8.9,81,null,null,null,null,null,null,null,null,null,null,"CMV 9 - 14",null,0,0,0,58,56,0,0]
[null,null,"25 kg","350 g","Elevé","femelle","femelle de race à viande                                                                                               poids 25 kg  -  GMQ   350 g",0.95,119,3.7,10.3,82,null,null,null,null,{"$f":"SUM(R54:R59)*100","v":0},"MAT",null,null,null,null,"Drêches de blé",18,0.67,178,157,4.5,1.2,31.6,6.1]
[null,null,"25 kg","400 g","Elevé","femelle","femelle de race à viande                                                                                               poids 25 kg  -  GMQ   400 g","ND","ND","ND","ND",83,null,null,null,null,null,null,null,null,null,null,"Féverole",11,1.03,170,97,3.5,0.8,31.1,9.6]
[null,null,"25 kg","450 g","Elevé","femelle","femelle de race à viande                                                                                               poids 25 kg  -  GMQ   450 g","ND","ND","ND","ND",84,null,null,null,null,null,null,null,null,null,null,"Graines de colza",3,1.68,12,61,4.9000000000000004,2.6,20.7,8.9]
[null,null,"30 kg","150 g","Elevé","femelle","femelle de race à viande                                                                                               poids 30 kg  -  GMQ   150 g",0.91,72,2.4,5.8,106,null,null,null,null,null,null,null,null,null,null,"Graines de coton",10,0.85,131,77,4.5999999999999996,0.9,23.4,25.9]
[null,null,"30 kg","200 g","Elevé","femelle","femelle de race à viande                                                                                               poids 30 kg  -  GMQ   200 g",0.96,84,2.8,7.1,107,null,null,null,{"$f":"U9","v":0},{"$f":"VLOOKUP(W9,$W$44:$AE$93,9)","v":{"$error":"#N/A"}},{"$f":"IF(P66=0,0,(Q66/100)*(P66/100))","v":0},null,null,null,null,"Huile de colza",0,2.78,0,0,0,0,0,0]
[null,null,"30 kg","250 g","Elevé","femelle","femelle de race à viande                                                                                               poids 30 kg  -  GMQ   250 g",1.01,95,3.2,8.5,108,null,null,null,{"$f":"U11","v":0},{"$f":"VLOOKUP(W11,$W$44:$AE$93,9)","v":{"$error":"#N/A"}},{"$f":"IF(P67=0,0,(Q67/100)*(P67/100))","v":0},null,null,null,null,"Lupin",4,1.18,213,106,2.8,1.9,38.5,12.8]
[null,null,"30 kg","300 g","Elevé","femelle","femelle de race à viande                                                                                               poids 30 kg  -  GMQ   300 g",1.04,107,3.6,9.6999999999999993,109,null,null,null,{"$f":"U13","v":0},{"$f":"VLOOKUP(W13,$W$44:$AE$93,9)","v":{"$error":"#N/A"}},0,null,null,null,null,"Luzerne deshydratée",5,0.54,103,91,1.7,5.9,17.5,29.5]
[null,null,"30 kg","350 g","Elevé","femelle","femelle de race à viande                                                                                               poids 30 kg  -  GMQ   350 g",1.07,119,4,11.1,110,null,null,null,{"$f":"U15","v":0},{"$f":"VLOOKUP(W15,$W$44:$AE$93,9)","v":{"$error":"#N/A"}},0,null,null,null,null,"Maïs grain",2,1.06,64,84,1.9,0.3,9.4,2.5]
[null,null,"30 kg","400 g","Elevé","femelle","femelle de race à viande                                                                                               poids 30 kg  -  GMQ   400 g","ND","ND","ND","ND",111,null,null,null,{"$f":"U17","v":0},{"$f":"VLOOKUP(W17,$W$44:$AE$93,9)","v":{"$error":"#N/A"}},0,null,null,null,null,"Mélasse",13,0.75,63,54,0.2,0.4,14.5,0]
[null,null,"30 kg","450 g","Elevé","femelle","femelle de race à viande                                                                                               poids 30 kg  -  GMQ   450 g","ND","ND","ND","ND",112,null,null,null,{"$f":"U19","v":0},{"$f":"VLOOKUP(W19,$W$44:$AE$93,9)","v":{"$error":"#N/A"}},0,null,null,null,null,"Orge",9,0.93,69,87,2.6,0.4,11.6,5.2]
[null,null,"35 kg","150 g","Elevé","femelle","femelle de race à viande                                                                                               poids 35 kg  -  GMQ   150 g",1.01,73,2.8,6.5,134,null,null,null,null,null,null,null,null,null,null,"Pois",7,1.05,130,83,2.9,0.6,23.9,6]
[null,null,"35 kg","200 g","Elevé","femelle","femelle de race à viande                                                                                               poids 35 kg  -  GMQ   200 g",1.07,84,3.2,8,135,null,null,null,null,null,null,null,null,null,null,"Poudre de lait écrémé",3,1.17,196,75,9.1999999999999993,11.1,36,0]
[null,null,"35 kg","250 g","Elevé","femelle","femelle de race à viande                                                                                               poids 35 kg  -  GMQ   250 g",1.1499999999999999,96,3.6,9.5,136,null,null,null,null,{"$f":"SUM(R66:R71)*100","v":0},"CB",null,null,null,null,"Pulpe de betterave",5,0.87,59,97,0.8,2.7,9.1,19.399999999999999]
[null,null,"35 kg","300 g","Elevé","femelle","femelle de race à viande                                                                                               poids 35 kg  -  GMQ   300 g",1.18,107,4,10.5,137,null,null,null,null,null,null,null,null,null,null,"Sarrazin",null,0.76,77,82,2.2999999999999998,0.4,13.1,11.6]
[null,null,"35 kg","350 g","Elevé","femelle","femelle de race à viande                                                                                               poids 35 kg  -  GMQ   350 g",1.21,118,4.4000000000000004,12.4,138,null,null,null,null,null,null,null,null,null,null,"Seigle",5,1.03,59,85,2.2999999999999998,0.6,10.3,2.2000000000000002]
[null,null,"35 kg","400 g","Elevé","femelle","femelle de race à viande                                                                                               poids 35 kg  -  GMQ   400 g",1.23,130,4.8,13.9,139,null,null,null,null,null,null,null,null,null,null,"Sorgho",4,1.06,67,87,2.1,0.2,109,2.7]
[null,null,"35 kg","450 g","Elevé","femelle","femelle de race à viande                                                                                               poids 35 kg  -  GMQ   450 g","ND","ND","ND","ND",140,null,null,null,null,null,null,null,null,null,null,"Tourteau d'arachide",17,0.97,347,215,3.7,1.1000000000000001,54.6,7.6]
[null,null,"40 kg","150 g","Elevé","femelle","femelle de race à viande                                                                                               poids 40 kg  -  GMQ   150 g","ND","ND","ND","ND",162,null,null,null,null,null,null,null,null,null,null,"Tourteau de colza",7,0.8,219,138,8.1999999999999993,4.5999999999999996,35,13.9]
[null,null,"40 kg","200 g","Elevé","femelle","femelle de race à viande                                                                                               poids 40 kg  -  GMQ   200 g",1.21,76,3.5,9,163,null,null,null,null,null,null,null,null,null,null,"Tourteau de lin",19,0.84,227,179,5.3,2.5,35.9,11]
[null,null,"40 kg","250 g","Elevé","femelle","femelle de race à viande                                                                                               poids 40 kg  -  GMQ   250 g",1.31,87,3.9,10.5,164,null,null,null,null,null,null,null,null,null,null,"Tourteau de soja",18,1.05,331,229,4.4000000000000004,1.8,51.6,6.8]
[null,null,"40 kg","300 g","Elevé","femelle","femelle de race à viande                                                                                               poids 40 kg  -  GMQ   300 g",1.36,99,4.4000000000000004,12,165,null,null,null,null,null,null,null,null,null,null,"Tourteau de tournesol",27,0.46,178,93,6.6,2.1,37.299999999999997,23.6]
[null,null,"40 kg","350 g","Elevé","femelle","femelle de race à viande                                                                                               poids 40 kg  -  GMQ   350 g",1.4,100,4.8,13.6,166,null,null,null,null,null,null,null,null,null,null,"Triticale",6,1.02,63,84,2.6,0.4,11,2.7]
[null,null,"40 kg","400 g","Elevé","femelle","femelle de race à viande                                                                                               poids 40 kg  -  GMQ   400 g",1.43,121,5.2,15.3,167,null,null,null,null,null,null,null,null,null,null,"Urée",0,0,1443,0,0,0,0,0]
[null,null,"40 kg","450 g","Elevé","femelle","femelle de race à viande                                                                                               poids 40 kg  -  GMQ   450 g","ND","ND","ND","ND",168,null,null,null,null,null,null,null,null,null,null,"Vesce",null,1.01,161,90,3.4,0.9,29.6,7.4]
[null,null,"15 kg","150 g","Modéré","femelle","femelle de race rustique ou croisée                                                                                               poids 15 kg  -  GMQ   150 g",0.68,62,1.7,4.2,8]
[null,null,"15 kg","200 g","Modéré","femelle","femelle de race rustique ou croisée                                                                                               poids 15 kg  -  GMQ   200 g",0.69,75,2.1,5.3,9]
[null,null,"15 kg","250 g","Modéré","femelle","femelle de race rustique ou croisée                                                                                               poids 15 kg  -  GMQ   250 g",0.71,87,2.5,6.4,10]
[null,null,"15 kg","300 g","Modéré","femelle","femelle de race rustique ou croisée                                                                                               poids 15 kg  -  GMQ   300 g","ND","ND",2.9,"ND",11]
[null,null,"15 kg","350 g","Modéré","femelle","femelle de race rustique ou croisée                                                                                               poids 15 kg  -  GMQ   350 g","ND","ND","ND","ND",12]
[null,null,"15 kg","400 g","Modéré","femelle","femelle de race rustique ou croisée                                                                                               poids 15 kg  -  GMQ   400 g","ND","ND","ND","ND",13]
[null,null,"15 kg","450 g","Modéré","femelle","femelle de race rustique ou croisée                                                                                               poids 15 kg  -  GMQ   450 g","ND","ND","ND","ND",14]
[null,null,"20 kg","150 g","Modéré","femelle","femelle de race rustique ou croisée                                                                                               poids 20 kg  -  GMQ   150 g",0.8,65,1.9,4.5999999999999996,36]
[null,null,"20 kg","200 g","Modéré","femelle","femelle de race rustique ou croisée                                                                                               poids 20 kg  -  GMQ   200 g",0.84,78,2.2999999999999998,5.7,37]
[null,null,"20 kg","250 g","Modéré","femelle","femelle de race rustique ou croisée                                                                                               poids 20 kg  -  GMQ   250 g",0.89,90,2.7,6.8,38]
[null,null,"20 kg","300 g","Modéré","femelle","femelle de race rustique ou croisée                                                                                               poids 20 kg  -  GMQ   300 g",0.91,103,3,8,39]
[null,null,"20 kg","350 g","Modéré","femelle","femelle de race rustique ou croisée                                                                                               poids 20 kg  -  GMQ   350 g","ND","ND","ND","ND",40]
[null,null,"20 kg","400 g","Modéré","femelle","femelle de race rustique ou croisée                                                                                               poids 20 kg  -  GMQ   400 g","ND","ND","ND","ND",41]
[null,null,"20 kg","450 g","Modéré","femelle","femelle de race rustique ou croisée                                                                                               poids 20 kg  -  GMQ   450 g","ND","ND","ND","ND",42]
[null,null,"25 kg","150 g","Modéré","femelle","femelle de race rustique ou croisée                                                                                               poids 25 kg  -  GMQ   150 g",0.92,68,2.2000000000000002,5.2,64]
[null,null,"25 kg","200 g","Modéré","femelle","femelle de race rustique ou croisée                                                                                               poids 25 kg  -  GMQ   200 g",0.98,80,2.6,6.4,65]
[null,null,"25 kg","250 g","Modéré","femelle","femelle de race rustique ou croisée                                                                                               poids 25 kg  -  GMQ   250 g",1.06,91,3,7.6,66]
[null,null,"25 kg","300 g","Modéré","femelle","femelle de race rustique ou croisée                                                                                               poids 25 kg  -  GMQ   300 g",1.1000000000000001,103,3.3,8.9,67]
[null,null,"25 kg","350 g","Modéré","femelle","femelle de race rustique ou croisée                                                                                               poids 25 kg  -  GMQ   350 g","ND","ND","ND","ND",68]
[null,null,"25 kg","400 g","Modéré","femelle","femelle de race rustique ou croisée                                                                                               poids 25 kg  -  GMQ   400 g","ND","ND","ND","ND",69]
[null,null,"25 kg","450 g","Modéré","femelle","femelle de race rustique ou croisée                                                                                               poids 25 kg  -  GMQ   450 g","ND","ND","ND","ND",70]
[null,null,"30 kg","150 g","Modéré","femelle","femelle de race rustique ou croisée                                                                                               poids 30 kg  -  GMQ   150 g",1.04,70,2.4,5.8,92]
[null,null,"30 kg","200 g","Modéré","femelle","femelle de race rustique ou croisée                                                                                               poids 30 kg  -  GMQ   200 g",1.1299999999999999,81,2.8,7.1,93]
[null,null,"30 kg","250 g","Modéré","femelle","femelle de race rustique ou croisée                                                                                               poids 30 kg  -  GMQ   250 g",1.23,93,3.2,8.5,94]
[null,null,"30 kg","300 g","Modéré","femelle","femelle de race rustique ou croisée                                                                                               poids 30 kg  -  GMQ   300 g",1.25,104,3.6,9.6999999999999993,95]
[null,null,"30 kg","350 g","Modéré","femelle","femelle de race rustique ou croisée                                                                                               poids 30 kg  -  GMQ   350 g","ND","ND","ND","ND",96]
[null,null,"30 kg","400 g","Modéré","femelle","femelle de race rustique ou croisée                                                                                               poids 30 kg  -  GMQ   400 g","ND","ND","ND","ND",97]
[null,null,"30 kg","450 g","Modéré","femelle","femelle de race rustique ou croisée                                                                                               poids 30 kg  -  GMQ   450 g","ND","ND","ND","ND",98]
[null,null,"35 kg","150 g","Modéré","femelle","femelle de race rustique ou croisée                                                                                               poids 35 kg  -  GMQ   150 g","ND","ND","ND","ND",120]
[null,null,"35 kg","200 g","Modéré","femelle","femelle de race rustique ou croisée                                                                                               poids 35 kg  -  GMQ   200 g","ND","ND","ND","ND",121]
[null,null,"35 kg","250 g","Modéré","femelle","femelle de race rustique ou croisée                                                                                               poids 35 kg  -  GMQ   250 g","ND","ND","ND","ND",122]
[null,null,"35 kg","300 g","Modéré","femelle","femelle de race rustique ou croisée                                                                                               poids 35 kg  -  GMQ   300 g","ND","ND","ND","ND",123]
[null,null,"35 kg","350 g","Modéré","femelle","femelle de race rustique ou croisée                                                                                               poids 35 kg  -  GMQ   350 g","ND","ND","ND","ND",124]
[null,null,"35 kg","400 g","Modéré","femelle","femelle de race rustique ou croisée                                                                                               poids 35 kg  -  GMQ   400 g","ND","ND","ND","ND",125]
[null,null,"35 kg","450 g","Modéré","femelle","femelle de race rustique ou croisée                                                                                               poids 35 kg  -  GMQ   450 g","ND","ND","ND","ND",126]
[null,null,"40 kg","150 g","Modéré","femelle","femelle de race rustique ou croisée                                                                                               poids 40 kg  -  GMQ   150 g","ND","ND","ND","ND",148]
[null,null,"40 kg","200 g","Modéré","femelle","femelle de race rustique ou croisée                                                                                               poids 40 kg  -  GMQ   200 g","ND","ND","ND","ND",149]
[null,null,"40 kg","250 g","Modéré","femelle","femelle de race rustique ou croisée                                                                                               poids 40 kg  -  GMQ   250 g","ND","ND","ND","ND",150]
[null,null,"40 kg","300 g","Modéré","femelle","femelle de race rustique ou croisée                                                                                               poids 40 kg  -  GMQ   300 g","ND","ND","ND","ND",151]
[null,null,"40 kg","350 g","Modéré","femelle","femelle de race rustique ou croisée                                                                                               poids 40 kg  -  GMQ   350 g","ND","ND","ND","ND",152]
[null,null,"40 kg","400 g","Modéré","femelle","femelle de race rustique ou croisée                                                                                               poids 40 kg  -  GMQ   400 g","ND","ND","ND","ND",153]
[null,null,"40 kg","450 g","Modéré","femelle","femelle de race rustique ou croisée                                                                                               poids 40 kg  -  GMQ   450 g","ND","ND","ND","ND",154]
[null,null,"15 kg","150 g","Elevé","mâle","mâle de race à viande                                                                                               poids 15 kg  -  GMQ   150 g","ND","ND","ND","ND",15]
[null,null,"15 kg","200 g","Elevé","mâle","mâle de race à viande                                                                                               poids 15 kg  -  GMQ   200 g","ND","ND","ND","ND",16]
[null,null,"15 kg","250 g","Elevé","mâle","mâle de race à viande                                                                                               poids 15 kg  -  GMQ   250 g","ND","ND","ND","ND",17]
[null,null,"15 kg","300 g","Elevé","mâle","mâle de race à viande                                                                                               poids 15 kg  -  GMQ   300 g","ND","ND","ND","ND",18]
[null,null,"15 kg","350 g","Elevé","mâle","mâle de race à viande                                                                                               poids 15 kg  -  GMQ   350 g","ND","ND","ND","ND",19]
[null,null,"15 kg","400 g","Elevé","mâle","mâle de race à viande                                                                                               poids 15 kg  -  GMQ   400 g","ND","ND","ND","ND",20]
[null,null,"15 kg","450 g","Elevé","mâle","mâle de race à viande                                                                                               poids 15 kg  -  GMQ   450 g","ND","ND","ND","ND",21]
[null,null,"20 kg","150 g","Elevé","mâle","mâle de race à viande                                                                                               poids 20 kg  -  GMQ   150 g",0.63,71,1.9,4.5999999999999996,43]
[null,null,"20 kg","200 g","Elevé","mâle","mâle de race à viande                                                                                               poids 20 kg  -  GMQ   200 g",0.67,85,2.2999999999999998,5.7,44]
[null,null,"20 kg","250 g","Elevé","mâle","mâle de race à viande                                                                                               poids 20 kg  -  GMQ   250 g",0.71,99,2.7,6.8,45]
[null,null,"20 kg","300 g","Elevé","mâle","mâle de race à viande                                                                                               poids 20 kg  -  GMQ   300 g",0.75,113,3,8,46]
[null,null,"20 kg","350 g","Elevé","mâle","mâle de race à viande                                                                                               poids 20 kg  -  GMQ   350 g","ND","ND","ND","ND",47]
[null,null,"20 kg","400 g","Elevé","mâle","mâle de race à viande                                                                                               poids 20 kg  -  GMQ   400 g","ND","ND","ND","ND",48]
[null,null,"20 kg","450 g","Elevé","mâle","mâle de race à viande                                                                                               poids 20 kg  -  GMQ   450 g","ND","ND","ND","ND",49]
[null,null,"25 kg","150 g","Elevé","mâle","mâle de race à viande                                                                                               poids 25 kg  -  GMQ   150 g",0.75,73,2.2000000000000002,5.2,71]
[null,null,"25 kg","200 g","Elevé","mâle","mâle de race à viande                                                                                               poids 25 kg  -  GMQ   200 g",0.77,86,2.6,6.4,72]
[null,null,"25 kg","250 g","Elevé","mâle","mâle de race à viande                                                                                               poids 25 kg  -  GMQ   250 g",0.8,100,3,7.6,73]
[null,null,"25 kg","300 g","Elevé","mâle","mâle de race à viande                                                                                               poids 25 kg  -  GMQ   300 g",0.82,114,3.3,8.9,74]
[null,null,"25 kg","350 g","Elevé","mâle","mâle de race à viande                                                                                               poids 25 kg  -  GMQ   350 g",0.85,127,3.7,10.3,75]
[null,null,"25 kg","400 g","Elevé","mâle","mâle de race à viande                                                                                               poids 25 kg  -  GMQ   400 g","ND","ND","ND","ND",76]
[null,null,"25 kg","450 g","Elevé","mâle","mâle de race à viande                                                                                               poids 25 kg  -  GMQ   450 g","ND","ND","ND","ND",77]
[null,null,"30 kg","150 g","Elevé","mâle","mâle de race à viande                                                                                               poids 30 kg  -  GMQ   150 g",0.87,75,2.4,5.8,99]
[null,null,"30 kg","200 g","Elevé","mâle","mâle de race à viande                                                                                               poids 30 kg  -  GMQ   200 g",0.91,88,2.8,7.1,100]
[null,null,"30 kg","250 g","Elevé","mâle","mâle de race à viande                                                                                               poids 30 kg  -  GMQ   250 g",0.96,101,3.2,8.5,101]
[null,null,"30 kg","300 g","Elevé","mâle","mâle de race à viande                                                                                               poids 30 kg  -  GMQ   300 g",0.98,114,3.6,9.6999999999999993,102]
[null,null,"30 kg","350 g","Elevé","mâle","mâle de race à viande                                                                                               poids 30 kg  -  GMQ   350 g",1,127,4,11.1,103]
[null,null,"30 kg","400 g","Elevé","mâle","mâle de race à viande                                                                                               poids 30 kg  -  GMQ   400 g",1.03,142,4.4000000000000004,12.6,104]
[null,null,"30 kg","450 g","Elevé","mâle","mâle de race à viande                                                                                               poids 30 kg  -  GMQ   450 g","ND","ND","ND","ND",105]
[null,null,"35 kg","150 g","Elevé","mâle","mâle de race à viande                                                                                               poids 35 kg  -  GMQ   150 g",0.99,76,2.8,6.5,127]
[null,null,"35 kg","200 g","Elevé","mâle","mâle de race à viande                                                                                               poids 35 kg  -  GMQ   200 g",1.05,89,3.2,8,128]
[null,null,"35 kg","250 g","Elevé","mâle","mâle de race à viande                                                                                               poids 35 kg  -  GMQ   250 g",1.1100000000000001,101,3.6,9.5,129]
[null,null,"35 kg","300 g","Elevé","mâle","mâle de race à viande                                                                                               poids 35 kg  -  GMQ   300 g",1.1399999999999999,114,4,10.5,130]
[null,null,"35 kg","350 g","Elevé","mâle","mâle de race à viande                                                                                               poids 35 kg  -  GMQ   350 g",1.1599999999999999,126,4.4000000000000004,12.4,131]
[null,null,"35 kg","400 g","Elevé","mâle","mâle de race à viande                                                                                               poids 35 kg  -  GMQ   400 g",1.18,139,4.8,13.9,132]
[null,null,"35 kg","450 g","Elevé","mâle","mâle de race à viande                                                                                               poids 35 kg  -  GMQ   450 g",1.2,150,5.2,15.4,133]
[null,null,"40 kg","150 g","Elevé","mâle","mâle de race à viande                                                                                               poids 40 kg  -  GMQ   150 g","ND","ND","ND","ND",155]
[null,null,"40 kg","200 g","Elevé","mâle","mâle de race à viande                                                                                               poids 40 kg  -  GMQ   200 g",1.18,90,3.5,9,156]
[null,null,"40 kg","250 g","Elevé","mâle","mâle de race à viande                                                                                               poids 40 kg  -  GMQ   250 g",1.27,102,3.9,10.5,157]
[null,null,"40 kg","300 g","Elevé","mâle","mâle de race à viande                                                                                               poids 40 kg  -  GMQ   300 g",1.32,115,4.4000000000000004,12,158]
[null,null,"40 kg","350 g","Elevé","mâle","mâle de race à viande                                                                                               poids 40 kg  -  GMQ   350 g",1.37,127,4.8,13.6,159]
[null,null,"40 kg","400 g","Elevé","mâle","mâle de race à viande                                                                                               poids 40 kg  -  GMQ   400 g",1.39,140,5.2,15.3,160]
[null,null,"40 kg","450 g","Elevé","mâle","mâle de race à viande                                                                                               poids 40 kg  -  GMQ   450 g",1.42,153,5.6,16.8,161]
[null,null,"15 kg","150 g","Modéré","mâle","mâle de race rustique ou croisée                                                                                               poids 15 kg  -  GMQ   150 g",0.56999999999999995,65,1.7,4.2,1]
[null,null,"15 kg","200 g","Modéré","mâle","mâle de race rustique ou croisée                                                                                               poids 15 kg  -  GMQ   200 g",0.57999999999999996,78,2.1,5.3,2]
[null,null,"15 kg","250 g","Modéré","mâle","mâle de race rustique ou croisée                                                                                               poids 15 kg  -  GMQ   250 g",0.59,92,2.5,6.4,3]
[null,null,"15 kg","300 g","Modéré","mâle","mâle de race rustique ou croisée                                                                                               poids 15 kg  -  GMQ   300 g",0.6,108,2.9,7.5,4]
[null,null,"15 kg","350 g","Modéré","mâle","mâle de race rustique ou croisée                                                                                               poids 15 kg  -  GMQ   350 g","ND","ND","ND","ND",5]
[null,null,"15 kg","400 g","Modéré","mâle","mâle de race rustique ou croisée                                                                                               poids 15 kg  -  GMQ   400 g","ND","ND","ND","ND",6]
[null,null,"15 kg","450 g","Modéré","mâle","mâle de race rustique ou croisée                                                                                               poids 15 kg  -  GMQ   450 g","ND","ND","ND","ND",7]
[null,null,"20 kg","150 g","Modéré","mâle","mâle de race rustique ou croisée                                                                                               poids 20 kg  -  GMQ   150 g",0.72,69,1.9,4.5999999999999996,29]
[null,null,"20 kg","200 g","Modéré","mâle","mâle de race rustique ou croisée                                                                                               poids 20 kg  -  GMQ   200 g",0.75,82,2.2999999999999998,5.7,30]
[null,null,"20 kg","250 g","Modéré","mâle","mâle de race rustique ou croisée                                                                                               poids 20 kg  -  GMQ   250 g",0.79,96,2.7,6.8,31]
[null,null,"20 kg","300 g","Modéré","mâle","mâle de race rustique ou croisée                                                                                               poids 20 kg  -  GMQ   300 g",0.8,110,3,8,32]
[null,null,"20 kg","350 g","Modéré","mâle","mâle de race rustique ou croisée                                                                                               poids 20 kg  -  GMQ   350 g","ND","ND","ND","ND",33]
[null,null,"20 kg","400 g","Modéré","mâle","mâle de race rustique ou croisée                                                                                               poids 20 kg  -  GMQ   400 g","ND","ND","ND","ND",34]
[null,null,"20 kg","450 g","Modéré","mâle","mâle de race rustique ou croisée                                                                                               poids 20 kg  -  GMQ   450 g","ND","ND","ND","ND",35]
[null,null,"25 kg","150 g","Modéré","mâle","mâle de race rustique ou croisée                                                                                               poids 25 kg  -  GMQ   150 g",0.87,71,2.2000000000000002,5.2,57]
[null,null,"25 kg","200 g","Modéré","mâle","mâle de race rustique ou croisée                                                                                               poids 25 kg  -  GMQ   200 g",0.93,84,2.6,6.4,58]
[null,null,"25 kg","250 g","Modéré","mâle","mâle de race rustique ou croisée                                                                                               poids 25 kg  -  GMQ   250 g",1,97,3,7.6,59]
[null,null,"25 kg","300 g","Modéré","mâle","mâle de race rustique ou croisée                                                                                               poids 25 kg  -  GMQ   300 g",1.03,110,3.3,8.9,60]
[null,null,"25 kg","350 g","Modéré","mâle","mâle de race rustique ou croisée                                                                                               poids 25 kg  -  GMQ   350 g",1.05,123,3.7,10.3,61]
[null,null,"25 kg","400 g","Modéré","mâle","mâle de race rustique ou croisée                                                                                               poids 25 kg  -  GMQ   400 g","ND","ND","ND","ND",62]
[null,null,"25 kg","450 g","Modéré","mâle","mâle de race rustique ou croisée                                                                                               poids 25 kg  -  GMQ   450 g","ND","ND","ND","ND",63]
[null,null,"30 kg","150 g","Modéré","mâle","mâle de race rustique ou croisée                                                                                               poids 30 kg  -  GMQ   150 g",1.01,73,2.4,5.8,85]
[null,null,"30 kg","200 g","Modéré","mâle","mâle de race rustique ou croisée                                                                                               poids 30 kg  -  GMQ   200 g",1.0900000000000001,86,2.8,7.1,86]
[null,null,"30 kg","250 g","Modéré","mâle","mâle de race rustique ou croisée                                                                                               poids 30 kg  -  GMQ   250 g",1.19,98,3.2,8.5,87]
[null,null,"30 kg","300 g","Modéré","mâle","mâle de race rustique ou croisée                                                                                               poids 30 kg  -  GMQ   300 g",1.25,111,3.6,9.6999999999999993,88]
[null,null,"30 kg","350 g","Modéré","mâle","mâle de race rustique ou croisée                                                                                               poids 30 kg  -  GMQ   350 g",1.29,123,4,11.1,89]
[null,null,"30 kg","400 g","Modéré","mâle","mâle de race rustique ou croisée                                                                                               poids 30 kg  -  GMQ   400 g",1.33,136,4.4000000000000004,12.6,90]
[null,null,"30 kg","450 g","Modéré","mâle","mâle de race rustique ou croisée                                                                                               poids 30 kg  -  GMQ   450 g","ND","ND","ND","ND",91]
[null,null,"35 kg","150 g","Modéré","mâle","mâle de race rustique ou croisée                                                                                               poids 35 kg  -  GMQ   150 g","ND","ND","ND","ND",113]
[null,null,"35 kg","200 g","Modéré","mâle","mâle de race rustique ou croisée                                                                                               poids 35 kg  -  GMQ   200 g",1.27,87,3.2,8,114]
[null,null,"35 kg","250 g","Modéré","mâle","mâle de race rustique ou croisée                                                                                               poids 35 kg  -  GMQ   250 g",1.38,99,3.6,9.5,115]
[null,null,"35 kg","300 g","Modéré","mâle","mâle de race rustique ou croisée                                                                                               poids 35 kg  -  GMQ   300 g",1.47,110,4,10.5,116]
[null,null,"35 kg","350 g","Modéré","mâle","mâle de race rustique ou croisée                                                                                               poids 35 kg  -  GMQ   350 g",1.57,122,4.4000000000000004,12.4,117]
[null,null,"35 kg","400 g","Modéré","mâle","mâle de race rustique ou croisée                                                                                               poids 35 kg  -  GMQ   400 g",1.6,134,4.8,13.9,118]
[null,null,"35 kg","450 g","Modéré","mâle","mâle de race rustique ou croisée                                                                                               poids 35 kg  -  GMQ   450 g","ND","ND","ND","ND",119]
[null,null,"40 kg","150 g","Modéré","mâle","mâle de race rustique ou croisée                                                                                               poids 40 kg  -  GMQ   150 g","ND","ND","ND","ND",141]
[null,null,"40 kg","200 g","Modéré","mâle","mâle de race rustique ou croisée                                                                                               poids 40 kg  -  GMQ   200 g","ND","ND","ND","ND",142]
[null,null,"40 kg","250 g","Modéré","mâle","mâle de race rustique ou croisée                                                                                               poids 40 kg  -  GMQ   250 g","ND","ND","ND","ND",143]
[null,null,"40 kg","300 g","Modéré","mâle","mâle de race rustique ou croisée                                                                                               poids 40 kg  -  GMQ   300 g","ND","ND","ND","ND",144]
[null,null,"40 kg","350 g","Modéré","mâle","mâle de race rustique ou croisée                                                                                               poids 40 kg  -  GMQ   350 g","ND","ND","ND","ND",145]
[null,null,"40 kg","400 g","Modéré","mâle","mâle de race rustique ou croisée                                                                                               poids 40 kg  -  GMQ   400 g","ND","ND","ND","ND",146]
[null,null,"40 kg","450 g","Modéré","mâle","mâle de race rustique ou croisée                                                                                               poids 40 kg  -  GMQ   450 g","ND","ND","ND","ND",147]

{"sheet":"PATURAGE","index":15,"n_rows":34,"n_cols":14,"rows_kept":34,"cut":false,"hidden":false,"merged":[[28,10,29,11],[6,11,6,12],[6,9,6,10],[11,2,11,4],[21,7,21,8],[21,11,21,13],[26,12,27,13],[11,10,12,11],[11,12,12,13],[14,10,16,14],[10,2,10,4],[24,7,24,8],[11,5,13,6],[15,3,15,4],[13,12,13,13],[14,5,16,9],[0,1,0,14],[1,1,1,14],[3,6,3,11],[6,4,6,5],[12,3,12,4],[8,10,10,13]]}
[null,"ALIM'ovins(v. 5.1) "]
[null,"Rationnement des ovins"]
[]
[null,null,null,null,null,null,"Pâturage"]
[]
[null,null,"Saisissez la surface et le nombre d'animaux.             Saisir les hauteurs d'herbe mesurées et prévues"]
[null,"Surface de la parcelle",null,"ha","Hauteur d'herbe à l'entrée",null,null,"cm*",null,"Hauteur de sortie prévue",null,null,null,"cm"]
[]
[null,"Nombre de femelles",null,null,null,null,"densité",null,null,null,"Nombre de jours de pâturage d'avance  "]
[null,null,null,null,null,null,"de la"]
[null,"Catégorie",null,null,null,null,"prairie"]
[null,null,{"$f":"IF(C11=\"\",\"\",CONCATENATE(N23,\" kg MS /jour\"))","v":""},null,null,"Pousse de                              l'herbe **",null,null,null,null,{"$f":"IF(C7=\"\",\"\",IF(H31=1,(C13/C16),IF(H31=2,(C13/C16)*1.07,IF(H31=3,(C13/C16)*1.15,(C13/C16)*1.3))))","v":""},null,{"$f":"IF(K12=\"\",\"\",\"Jours\")","v":""}]
[null,"Quantité disponible",{"$f":"IF(C7=\"\",\"\",(G7-L7)*I23*C7)","v":""},"kg MS"]
[null,null,{"$f":"IF(C7=\"\",\"\",CONCATENATE((C13/C7)/1000,\"  t MS /ha\"))","v":""},null,null,null,null,null,null,null,null,{"$f":"IF(K12=\"\",\"\",(C9*0.15)/C7)","v":""},{"$f":"IF(K12=\"\",\"\",\"UGB / ha\")","v":""}]
[null,null,{"$f":"IF(C8=\"\",\"\",CONCATENATE((C14/C8)/1000,\"  t MS /ha\"))","v":""},null,null,"* Hauteur d'herbe mesurée avec l'herbomètre             ** Estimation de la pousse de l'herbe en fonction de la saison",null,null,null,null,{"$f":"IF(G7>13,\"Trop de gaspillage                   Il vaut mieux faucher !\",IF(C7=\"\",\"\",IF(J32>J33*1.2,\"Risques de gaspillage importants: Augmentez le chargement !\",\"\")))","v":""}]
[null,"Besoin d'herbe quotidien",{"$f":"IF(C7=\"\",\"\",N23*C9)","v":""},"kg MS "]
[]
[]
[]
[]
[]
[null,null,null,null,null,null,null,"Densité",null,null,null,"Besoins"]
[null,null,"Brebis vide",null,null,null,null,2,{"$f":"IF(H23=1,250,IF(H23=2,300,350))","v":300},null,null,{"$f":"C11","v":0},null,{"$f":"IF(L23=\"Brebis allaitante\",3.5,IF(L23=\"Agnelle\",2,2.5))","v":2.5}]
[null,null,"Brebis gestante"]
[null,null,"Brebis allaitante",null,null,null,null,"pousse"]
[null,null,"Agnelle",null,null,null,null,"Nulle (Hiver - Sécheresse)"]
[null,null,"Bélier",null,null,null,null,"Faible (Eté)",null,null,null,null,{"$f":"IF(H31=1,(C13/C16),IF(H31=2,(C13/C16)*1.07,IF(H31=3,(C13/C16)*1.15,(C13/C16)*1.3)))","v":{"$error":"#VALUE!"}}]
[null,null,null,null,null,null,null,"Moyenne (Automne)"]
[null,null,null,null,null,null,null,"Forte (Printemps)"]
[]
[null,null,null,null,null,null,null,1,null,{"$f":"IF(H31=1,0,IF(H31=2,0.5,IF(H31=3,1,2)))","v":0}]
[null,null,null,null,null,null,null,{"$f":"J32/C16","v":{"$error":"#VALUE!"}},null,{"$f":"(J31*I23*C7)/7","v":0}]
[null,null,null,null,null,null,null,{"$f":"H32*(K12/7)","v":{"$error":"#VALUE!"}},null,{"$f":"C16","v":""}]
[null,null,null,null,null,null,null,{"$f":"H33/K12","v":{"$error":"#VALUE!"}}]

{"sheet":"NOUVEAU","index":16,"n_rows":24,"n_cols":27,"rows_kept":24,"cut":false,"hidden":false,"merged":[[9,6,9,13],[15,2,16,4],[3,8,3,14],[19,4,19,26],[0,17,0,19],[7,1,9,5],[8,6,8,13],[0,1,0,14],[1,1,1,14],[5,1,5,14],[6,1,6,13],[7,6,7,13],[12,17,13,17],[12,19,13,19]]}
[null,"ALIM'ovins(v. 5.1) ",null,null,null,null,null,null,null,null,null,null,null,null,null,null,null,"LISTE DE VOS ALIMENTS                                  FOURRAGES                              CONCENTRES"]
[null,"Rationnement des ovins",null,null,null,null,null,null,null,null,null,null,null,null,null,null,null,{"$f":"IF(E22=\"\",\"\",E22)","v":"Betterave fourragère"},null,{"$f":"IF(R22=\"\",\"\",R22)","v":"ACL 40"}]
[null,null,null,null,null,null,null,null,null,null,null,null,null,null,null,null,null,{"$f":"IF(E23=\"\",\"\",E23)","v":"Foin de crau"},null,""]
[null,null,null,null,null,null,null,null," Nouveaux",null,null,null,null,null,null,null,null,{"$f":"IF(E24=\"\",\"\",E24)","v":""},null,"Epeautre"]
[null,null,null,null,null,null,null,null,null,null,null,null,null,null,null,null,null,{"$f":"IF(E25=\"\",\"\",E25)","v":""},null,""]
[null,"VALEURS ALIMENTAIRES DE VOS ALIMENTS",null,null,null,null,null,null,null,null,null,null,null,null,null,null,null,"",null,""]
[null,null,null,null,null,null,null,null,null,null,null,null,null,null,null,null,null,"","",""]
[null,"Les valeurs seront reportées automatiquement dans les listes d'aliments disponibles aux rubriques                               \"Mon fourrage\" et \"Mon concentré\"",null,null,null,null,null,null,null,null,null,null,null,null,null,null,null,"","",""]
[null,null,null,null,null,null,"Valeurs alimentaires / kg ",null,null,null,null,null,null,null,null,null,null,"","",""]
[null,null,null,null,null,null,"      Saisissez les valeurs alimentaires",null,null,null,null,null,null,null,null,null,null,"","",""]
[null,null,null,null,"       Saisir le nom de l'aliment",null,"% MS","UEM","UFL","UFV","PDIN","PDIE","Pabs","Caabs",null,null,null,"",null,""]
[null,null,"FOURRAGE",null,null,null,null,null,null,null,null,null,null,null,null,null,null,"Maximum 7  fourrages","","Maximum 8 concentrés"]
[null,null,null,null,"       Saisir le nom de l'aliment",null,"UFL","UFV","PDIN","PDIE","Pabs","Caabs","MAT","CB",null,null,null,"Pour supprimer un aliment, choisissez dans la liste","","Pour supprimer un aliment, choisissez dans la liste"]
[null,null,"CONCENTRE"]
[null,null,null,null,"N'oubliez pas de valider l'aliment"]
[null,null,{"$f":"IF(PREVISION!D12=\"\",\"       Si vous ne connaissez pas les valeurs UF et PDI de l'aliment, cliquez sur PREVISION\",\"Rappel des valeurs alimentaires calculées (PREVISION)\")","v":"       Si vous ne connaissez pas les valeurs UF et PDI de l'aliment, cliquez sur PREVISION"},null,null,null,null,null,{"$f":"IF(PREVISION!D12=\"\",\"\",\"UFL\")","v":""},{"$f":"IF(PREVISION!D12=\"\",\"\",\"UFV\")","v":""},{"$f":"IF(PREVISION!D12=\"\",\"\",\"PDIN\")","v":""},{"$f":"IF(PREVISION!D12=\"\",\"\",\"PDIE\")","v":""},{"$f":"IF(PREVISION!D12=\"\",\"\",\"P\")","v":""},{"$f":"IF(PREVISION!D12=\"\",\"\",\"Ca\")","v":""},null,null,null,"",""]
[null,null,null,null,null,null,null,null,{"$f":"PREVISION!J12","v":""},{"$f":"PREVISION!J14","v":""},{"$f":"PREVISION!J18","v":""},{"$f":"PREVISION!J20","v":""},{"$f":"PREVISION!N18","v":""},{"$f":"PREVISION!N20","v":""}]
[]
[]
[null,null,null,null,"TABLE DE VOS ALIMENTS"]
[null,null,null,null,"FOURRAGE",null,"% MS","U.E.M..","U.F.L.","U.F.V.","P.D.I.N.","P.D.I.E.","Pabs","Caabs",null,null,null,"CONCENTRE",null,"U.F.L.","U.F.V.","P.D.I.N.","P.D.I.E.","Pabs","Caabs","MAT","CB"]
[null,null,null,null,"Betterave fourragère",null,13,0.91,1.1499999999999999,1.1599999999999999,62,86,1.1000000000000001,0.5,null,null,null,"ACL 40",null,0.63,0.62,166,114,1,2,40,1]
[null,null,null,null,"Foin de crau",null,85,1.37,0.77,0.69,75,87,2,3.7]
[null,null,null,null,null,null,null,null,null,null,null,null,null,null,null,null,null,"Epeautre",null,0.85,0.82,66,82,2.5,0.5,12,12.7]

{"sheet":"STOCKS","index":17,"n_rows":52,"n_cols":24,"rows_kept":52,"cut":false,"hidden":false,"merged":[[0,1,0,23],[1,1,1,23],[3,5,3,22],[15,1,15,2],[5,1,5,23],[7,10,7,14],[9,1,9,2],[13,1,13,2],[6,1,8,3],[7,6,8,7],[7,16,8,16],[7,18,8,18],[7,20,8,20],[7,22,8,23],[25,1,25,2],[33,1,33,2],[17,1,17,2],[19,10,19,14],[20,19,20,21],[21,1,21,2],[23,1,23,2],[19,6,20,7]]}
[null,"ALIM'ovins(v. 5.1) "]
[null,"Rationnement des ovins"]
[]
[null,null,null,null,null,"BILAN FOURRAGER"]
[]
[null,"EVALUATION DES STOCKS DISPONIBLES"]
[null,"Saisissez les surfaces et les rendements ou les quantités (en bottes ou m3)"]
[null,null,null,null,null,null,"Rendement (t MS/ha)",null,null,null,"Nombre de bottes",null,null,null,null,null,"Poids d'une botte (kg)",null,"% MS",null,"Type",null,"Total MS"]
[null,null,null,null,"Surface (ha)",null,null,null,"OU",null,"Produites",null,"Achetées",null,"Stocks (n-1)"]
[null,"Foin balle ronde",null,null,null,null,null,null,{"$f":"IF(G10=\"\",IF(E10=\"\",\"\",(K10*Q10*(S10/100))/(E10*1000)),\"\")","v":""},null,null,null,null,null,null,null,260,null,85,null,{"$f":"IF(Q10<150,\"90 x 90\",IF(Q10>260,\"150 x 150\",\"120 x 120\"))","v":"120 x 120"},null,{"$f":"IF(G10=\"\",IF(K10+M10+O10=0,\"\",(((K10+M10+O10)*Q10)*S10)/100000),(G10*E10)+(((M10+O10)*Q10)*S10)/100000)","v":""},{"$f":"IF(W10=\"\",\"\",\"t de MS\")","v":""}]
[]
[null,"Autre",null,null,null,null,null,null,{"$f":"IF(G12=\"\",IF(E12=\"\",\"\",(K12*Q12*(S12/100))/(E12*1000)),\"\")","v":""},null,null,null,null,null,null,null,260,null,85,null,{"$f":"IF(Q12<150,\"90 x 90\",IF(Q12>260,\"150 x 150\",\"120 x 120\"))","v":"120 x 120"},null,{"$f":"IF(G12=\"\",IF(K12+M12+O12=0,\"\",(((K12+M12+O12)*Q12)*S12)/100000),(G12*E12)+(((M12+O12)*Q12)*S12)/100000)","v":""},{"$f":"IF(W12=\"\",\"\",\"t de MS\")","v":""}]
[]
[null,"Foin haute densité",null,null,null,null,null,null,{"$f":"IF(G14=\"\",IF(E14=\"\",\"\",(K14*Q14*(S14/100))/(E14*1000)),\"\")","v":""},null,null,null,null,null,null,null,400,null,85,null,{"$f":"IF(Q14<400,\"80 x 90\",IF(Q14>500,\"120 x 90\",\"120 x 130\"))","v":"120 x 130"},null,{"$f":"IF(G14=\"\",IF(K14+M14+O14=0,\"\",(((K14+M14+O14)*Q14)*S14)/100000),(G14*E14)+(((M14+O14)*Q14)*S14)/100000)","v":""},{"$f":"IF(W14=\"\",\"\",\"t de MS\")","v":""}]
[]
[null,"Paille alimentaire",null,null,null,null,null,null,{"$f":"IF(G16=\"\",IF(E16=\"\",\"\",(K16*Q16*(S16/100))/(E16*1000)),\"\")","v":""},null,null,null,null,null,null,null,180,null,85,null,{"$f":"IF(Q16<100,\"90 x 90\",IF(Q16>160,\"150 x 150\",\"120 x 120\"))","v":"150 x 150"},null,{"$f":"IF(G16=\"\",IF(K16+M16+O16=0,\"\",(((K16+M16+O16)*Q16)*S16)/100000),(G16*E16)+(((M16+O16)*Q16)*S16)/100000)","v":""},{"$f":"IF(W16=\"\",\"\",\"t de MS\")","v":""}]
[]
[null,"Enrubannage",null,null,null,null,null,null,{"$f":"IF(G18=\"\",IF(E18=\"\",\"\",(K18*Q18*(S18/100))/(E18*1000)),\"\")","v":""},null,null,null,null,null,null,null,400,null,50,null,"120 x 120",null,{"$f":"IF(G18=\"\",IF(K18+M18+O18=0,\"\",(((K18+M18+O18)*Q18)*S18)/100000),(G18*E18)+(((M18+O18)*Q18)*S18)/100000)","v":""},{"$f":"IF(W18=\"\",\"\",\"t de MS\")","v":""}]
[]
[null,null,null,null,null,null,"Rendement (t MS/ha)",null,null,null,"Volumes (m3)"]
[null,null,null,null,"Surface (ha)",null,null,null,"  OU",null,"Produits",null,"Achetés",null,"Stocks (n-1)",null,"hauteur silo (cm)",null,"% MS","Densité                      (kg MS/ m3)"]
[null,"Ensilage herbe (couloir)",null,null,null,null,null,null,{"$f":"IF(G22=\"\",IF(E22=\"\",\"\",(K22*Q22*(S22/100))/(E22*1000)),\"\")","v":""},null,null,null,null,null,null,null,200,null,30,null,{"$f":"(5*S22)+(16*(Q22/100))+34","v":216},null,{"$f":"IF(G22=\"\",IF(K22+M22+O22=0,\"\",(((K22+M22+O22)*Q22)*S22)/100000),(G22*E22)+(((M22+O22)*Q22)*S22)/100000)","v":""},{"$f":"IF(W22=\"\",\"\",\"t de MS\")","v":""}]
[]
[null,"Ensilage herbe (taupe)",null,null,null,null,null,null,{"$f":"IF(G24=\"\",IF(E24=\"\",\"\",(K24*Q24*(S24/100))/(E24*1000)),\"\")","v":""},null,null,null,null,null,null,null,200,null,30,null,{"$f":"(5*S24)+(16*(Q24/100))+34","v":216},null,{"$f":"IF(G24=\"\",IF(K24+M24+O24=0,\"\",(((K24+M24+O24)*Q24)*S24)/100000),(G24*E24)+(((M24+O24)*Q24)*S24)/100000)","v":""},{"$f":"IF(W24=\"\",\"\",\"t de MS\")","v":""}]
[]
[null,"Ensilage maïs",null,null,null,null,null,null,{"$f":"IF(G26=\"\",IF(E26=\"\",\"\",(K26*Q26*(S26/100))/(E26*1000)),\"\")","v":""},null,null,null,null,null,null,null,200,null,30,null,{"$f":"(5*S26)+(16*(Q26/100))+34","v":216},null,{"$f":"IF(G26=\"\",IF(K26+M26+O26=0,\"\",(((K26+M26+O26)*Q26)*S26)/100000),(G26*E26)+(((M26+O26)*Q26)*S26)/100000)","v":""},{"$f":"IF(W26=\"\",\"\",\"t de MS\")","v":""}]
[]
[null,"Autre",null,null,null,null,null,null,{"$f":"IF(G28=\"\",IF(E28=\"\",\"\",(K28*Q28*(S28/100))/(E28*1000)),\"\")","v":""},null,null,null,null,null,null,null,200,null,30,null,{"$f":"(5*S28)+(16*(Q28/100))+34","v":216},null,{"$f":"IF(G28=\"\",IF(K28+M28+O28=0,\"\",(((K28+M28+O28)*Q28)*S28)/100000),(G28*E28)+(((M28+O28)*Q28)*S28)/100000)","v":""},{"$f":"IF(W28=\"\",\"\",\"t de MS\")","v":""}]
[]
[null,"Autre",null,null,null,null,null,null,{"$f":"IF(G30=\"\",IF(E30=\"\",\"\",(K30*Q30*(S30/100))/(E30*1000)),\"\")","v":""},null,null,null,null,null,null,null,130,null,30,null,{"$f":"(5*S30)+(16*(Q30/100))+34","v":204.8},null,{"$f":"IF(G30=\"\",IF(K30+M30+O30=0,\"\",(((K30+M30+O30)*Q30)*S30)/100000),(G30*E30)+(((M30+O30)*Q30)*S30)/100000)","v":""},{"$f":"IF(W30=\"\",\"\",\"t de MS\")","v":""}]
[]
[null,"Autre",null,null,null,null,null,null,{"$f":"IF(G32=\"\",IF(E32=\"\",\"\",(K32*Q32*(S32/100))/(E32*1000)),\"\")","v":""},null,null,null,null,null,null,null,190,null,30,null,{"$f":"(5*S32)+(16*(Q32/100))+34","v":214.4},null,{"$f":"IF(G32=\"\",IF(K32+M32+O32=0,\"\",(((K32+M32+O32)*Q32)*S32)/100000),(G32*E32)+(((M32+O32)*Q32)*S32)/100000)","v":""},{"$f":"IF(W32=\"\",\"\",\"t de MS\")","v":""}]
[]
[null,"Foin vrac",null,null,null,null,null,null,{"$f":"IF(G34=\"\",IF(E34=\"\",\"\",(K34*U34*(S34/100))/(E34*1000)),\"\")","v":""},null,null,null,null,null,null,null,null,null,85,null,90,null,{"$f":"IF(G34=\"\",IF(K34+M34+O34=0,\"\",(((K34+M34+U34)*Q34)*S34)/100000),(G34*E34)+(((M34+O34)*U34)*S34)/100000)","v":""},{"$f":"IF(W34=\"\",\"\",\"t de MS\")","v":""}]
[]
[]
[]
[]
[]
[]
[null,"90 x 90",null,null,null,null,null,null,null,null,null,null,null,null,1,null,120,null,80,null,80]
[null,"120 x 120",null,null,null,null,null,null,null,null,null,null,null,null,1.2,null,200,null,120,null,85]
[null,"150 x 150",null,null,null,null,null,null,null,null,null,null,null,null,1.5,null,280,null,180,null,90]
[null,"180 x 180",null,null,null,null,null,null,null,null,null,null,null,null,1.7,null,400,null,300,null,95]
[null,null,null,null,null,null,null,null,null,null,null,null,null,null,2]
[null,null,null,null,null,null,null,null,null,null,null,null,null,null,2.2000000000000002,null,300,null,20,null,40]
[null,null,null,null,null,null,null,null,null,null,null,null,null,null,2.5,null,350,null,25,null,45]
[null,null,null,null,null,null,null,null,null,null,null,null,null,null,null,null,400,null,30,null,50]
[null,null,null,null,null,null,null,null,null,null,null,null,null,null,null,null,450,null,35,null,55]
[null,null,null,null,null,null,null,null,null,null,null,null,null,null,null,null,500,null,40,null,60]
[null,null,null,null,null,null,null,null,null,null,null,null,null,null,null,null,550,null,45]
[null,null,null,null,null,null,null,null,null,null,null,null,null,null,null,null,600]

{"sheet":"BESOINS","index":18,"n_rows":51,"n_cols":23,"rows_kept":51,"cut":false,"hidden":false,"merged":[[19,17,21,22],[5,1,5,14],[5,17,5,22],[7,13,7,14],[7,20,8,21],[7,22,8,22],[9,17,10,19],[9,20,10,21],[9,22,10,22],[17,20,18,21],[17,17,18,19],[14,17,16,19],[14,20,16,21],[14,22,16,22],[1,1,1,22],[0,1,0,22],[3,1,3,22],[12,17,13,18],[12,19,13,19],[12,20,13,20],[12,21,13,21],[12,22,13,22],[25,17,26,19],[25,20,26,21],[22,17,24,19],[22,20,24,21],[22,22,24,22]]}
[null,"ALIM'ovins(v. 5.1) "]
[null,"Rationnement des ovins"]
[]
[null,"BILAN FOURRAGER"]
[]
[null,"EVALUATION DES BESOINS",null,null,null,null,null,null,null,null,null,null,null,null,null,null,null,"BILAN"]
[]
[null,"Lot",null,"Catégorie",null,"Effectif",null,"U.G.B",null,"Consommation (kg MS/j)",null,"Durée (jours)",null,"Besoins en MS",null,null,null,"Stocks disponibles",null,null,{"$f":"IF(SUM(STOCKS!W10:W34)=0,\"\",IF(STOCKS!W16=\"\",SUM(STOCKS!W10:W34),SUM(STOCKS!W10:W34)-STOCKS!W16))","v":""},null,{"$f":"IF(U8=\"\",\"\",\"t de MS\")","v":""}]
[null,"Lot N°1",null,null,null,null,null,{"$f":"IF(D9=\"\",\"\",VLOOKUP(D9,$D$41:$F$50,3))","v":""},null,{"$f":"IF(D9=\"\",\"\",VLOOKUP(D9,$D$41:$E$50,2))","v":""},null,null,null,{"$f":"IF(D9=\"\",\"\",(F9*J9*L9)/1000)","v":""},{"$f":"IF(D9=\"\",\"\",\"t de MS\")","v":""}]
[null,null,null,null,null,null,null,null,null,null,null,null,null,null,null,null,null,"Besoins du troupeau",null,null,{"$f":"IF(SUM(N9:N27)=0,\"\",SUM(N9:N27))","v":""},null,{"$f":"IF(U10=\"\",\"\",\"t de MS\")","v":""}]
[null,"Lot N°2",null,null,null,null,null,{"$f":"IF(D11=\"\",\"\",VLOOKUP(D11,$D$41:$F$50,3))","v":""},null,{"$f":"IF(D11=\"\",\"\",VLOOKUP(D11,$D$41:$E$50,2))","v":""},null,null,null,{"$f":"IF(D11=\"\",\"\",(F11*J11*L11)/1000)","v":""},{"$f":"IF(D11=\"\",\"\",\"t de MS\")","v":""}]
[]
[null,"Lot N°3",null,null,null,null,null,{"$f":"IF(D13=\"\",\"\",VLOOKUP(D13,$D$41:$F$50,3))","v":""},null,{"$f":"IF(D13=\"\",\"\",VLOOKUP(D13,$D$41:$E$50,2))","v":""},null,null,null,{"$f":"IF(D13=\"\",\"\",(F13*J13*L13)/1000)","v":""},{"$f":"IF(D13=\"\",\"\",\"t de MS\")","v":""},null,null,"Marge de sécurité",null,{"$f":"(V13*52)/100","v":4.16},"semaine(s)",8,"%"]
[]
[null,"Lot N°4",null,null,null,null,null,{"$f":"IF(D15=\"\",\"\",VLOOKUP(D15,$D$41:$F$50,3))","v":""},null,{"$f":"IF(D15=\"\",\"\",VLOOKUP(D15,$D$41:$E$50,2))","v":""},null,null,null,{"$f":"IF(D15=\"\",\"\",(F15*J15*L15)/1000)","v":""},{"$f":"IF(D15=\"\",\"\",\"t de MS\")","v":""},null,null,"BILAN FOURRAGER                ( hors paille)",null,null,{"$f":"IF(SUM(STOCKS!W10:W34)=0,\"\",IF(U10=\"\",\"\",U8-(U10*(1+(V13/100)))))","v":""},null,{"$f":"IF(U15=\"\",\"\",\"t de MS\")","v":""}]
[]
[null,"Lot N°5",null,null,null,null,null,{"$f":"IF(D17=\"\",\"\",VLOOKUP(D17,$D$41:$F$50,3))","v":""},null,{"$f":"IF(D17=\"\",\"\",VLOOKUP(D17,$D$41:$E$50,2))","v":""},null,null,null,{"$f":"IF(D17=\"\",\"\",(F17*J17*L17)/1000)","v":""},{"$f":"IF(D17=\"\",\"\",\"t de MS\")","v":""}]
[null,null,null,null,null,null,null,null,null,null,null,null,null,null,null,null,null,"en pourcentage des besoins",null,null,{"$f":"IF(U15=\"\",\"\",U15/U10)","v":""}]
[null,"Lot N°6",null,null,null,null,null,{"$f":"IF(D19=\"\",\"\",VLOOKUP(D19,$D$41:$F$50,3))","v":""},null,{"$f":"IF(D19=\"\",\"\",VLOOKUP(D19,$D$41:$E$50,2))","v":""},null,null,null,{"$f":"IF(D19=\"\",\"\",(F19*J19*L19)/1000)","v":""},{"$f":"IF(D19=\"\",\"\",\"t de MS\")","v":""}]
[null,null,null,null,null,null,null,null,null,null,null,null,null,null,null,null,null,{"$f":"IF(U8=\"\",\"\",IF(U15<0,\"Attention !                                                                                                votre bilan fourrager est déficitaire\",IF(U15>10,\"Votre bilan fourrager est excédentaire\",\"Votre bilan fourrager est équilibré\")))","v":""}]
[null,"Lot N°7",null,null,null,null,null,{"$f":"IF(D21=\"\",\"\",VLOOKUP(D21,$D$41:$F$50,3))","v":""},null,{"$f":"IF(D21=\"\",\"\",VLOOKUP(D21,$D$41:$E$50,2))","v":""},null,null,null,{"$f":"IF(D21=\"\",\"\",(F21*J21*L21)/1000)","v":""},{"$f":"IF(D21=\"\",\"\",\"t de MS\")","v":""}]
[]
[null,"Lot N°8",null,null,null,null,null,{"$f":"IF(D23=\"\",\"\",VLOOKUP(D23,$D$41:$F$50,3))","v":""},null,{"$f":"IF(D23=\"\",\"\",VLOOKUP(D23,$D$41:$E$50,2))","v":""},null,null,null,{"$f":"IF(D23=\"\",\"\",(F23*J23*L23)/1000)","v":""},{"$f":"IF(D23=\"\",\"\",\"t de MS\")","v":""},null,null,"BILAN FOURRAGER                (avec paille)",null,null,{"$f":"IF(STOCKS!W16=\"\",IF(SUM(STOCKS!W10:W34)=0,\"\",IF(U10=\"\",\"\",U8-(U10*(1+(V13/100))))),IF(SUM(STOCKS!W10:W34)=0,\"\",IF(U10=\"\",\"\",U15+STOCKS!W16)))","v":""},null,{"$f":"IF(U23=\"\",\"\",\"t de MS\")","v":""}]
[]
[null,"Lot N°9",null,null,null,null,null,{"$f":"IF(D25=\"\",\"\",VLOOKUP(D25,$D$41:$F$50,3))","v":""},null,{"$f":"IF(D25=\"\",\"\",VLOOKUP(D25,$D$41:$E$50,2))","v":""},null,null,null,{"$f":"IF(D25=\"\",\"\",(F25*J25*L25)/1000)","v":""},{"$f":"IF(D25=\"\",\"\",\"t de MS\")","v":""}]
[null,null,null,null,null,null,null,null,null,null,null,null,null,null,null,null,null,"en pourcentage des besoins",null,null,{"$f":"IF(U23=\"\",\"\",U23/U10)","v":""}]
[null,"Lot N°10",null,null,null,null,null,{"$f":"IF(D27=\"\",\"\",VLOOKUP(D27,$D$41:$F$50,3))","v":""},null,{"$f":"IF(D27=\"\",\"\",VLOOKUP(D27,$D$41:$E$50,2))","v":""},null,null,null,{"$f":"IF(D27=\"\",\"\",(F27*J27*L27)/1000)","v":""},{"$f":"IF(D27=\"\",\"\",\"t de MS\")","v":""}]
[]
[]
[]
[]
[]
[]
[]
[]
[]
[]
[]
[]
[]
[null,null,null,"Agneau à l'engrais",0.5,0.05]
[null,null,null,"Agnelle - 6 mois",0.5,0.05]
[null,null,null,"Agnelle + 6 mois",1,7.0000000000000007E-2,null,null,null,null,null,null,null,null,null,null,null,null,"Brebis",0.15]
[null,null,null,"Bélier - 1 an",1.5,0.15,null,null,null,null,null,null,null,null,null,null,null,null,"Agnelles - 6 mois",0.05]
[null,null,null,"Bélier - 6 mois",1,0.05,null,null,null,null,null,null,null,null,null,null,null,null,"Agnelles 6 mois et +",7.0000000000000007E-2]
[null,null,null,"Bélier adulte",2.5,0.15,null,null,null,null,null,null,null,null,null,null,null,null,"Béliers - 6 mois",0.05]
[null,null,null,"Brebis allaitante",2,0.15,null,null,null,null,null,null,null,null,null,null,null,null,"Béliers 6 mois et +",0.15]
[null,null,null,"Brebis de réforme",2,0.15,null,null,null,null,null,null,null,null,null,null,null,null,"Mâle castré de +12 mois",0.15]
[null,null,null,"Brebis gestante",1.5,0.15,null,null,null,null,null,null,null,null,null,null,null,null,"Agneaux de boucherie",0.05]
[null,null,null,"Brebis traite",2,0.15]
[null,null,null,"Brebis vide",2,0.15]